program: Gaussian 09
title: 000061403
version: EM64L-G09RevD.01
frameworkgroup: C1[X(C13H20O2)]
method: RPBEPBE
basis: SDD
operation: Freq
keyword: #pfreq=noraman
keyword: PBEPBE/SDD
title: #p freq=noraman PBEPBE/SDD
converged: YES YES NO NO
title: Mulliken charges:
elementType: O O C C C C C C C C C C C C C H H H H H H H H H H H H H H H H H H H H
charge: -0.286384 -0.255979 -0.557023 0.104484 -0.258620 0.465758 -0.217846 -0.386283 -0.693109 -0.446869 -0.377766 -0.681372 -0.218985 -0.226116 -0.247831 0.227888 0.200046 0.155149 0.191224 0.201777 0.214906 0.172873 0.218037 0.210660 0.241897 0.224059 0.210378 0.226313 0.276336 0.210494 0.224288 0.206740 0.222354 0.223112 0.225410
chargesum: 0.00000
title: Mulliken charges with hydrogens summed into heavy atoms:
elementType: O O C C C C C C C C C C C C C
charge: -0.286384 -0.255979 -0.129089 0.259633 0.134381 0.465758 0.169932 0.042413 -0.016774 -0.220556 -0.101430 -0.039850 0.003369 -0.003003 -0.022421
polarizability: 1.87513309e+02 4.93692896e+00 1.18211132e+02 1.00386537e-01 1.74896638e+01 1.31365290e+02
1716.lowfreq: -13.3658 -8.4838 -4.1691 0.0005 0.0007 0.0009 9.5457 13.1511 35.6113
frequency: 6.3049 12.6352 35.5426 36.2638 60.4582 81.5273 133.0388 143.8536 159.6704 182.4176 207.8740 225.9266 239.7886 288.7487 302.8815 314.6993 395.0161 405.3019 454.3552 494.1928 496.8760 541.0569 568.5289 617.7307 706.7378 749.9638 761.0373 769.4185 780.0115 854.6387 856.8611 887.4861 888.6106 900.0616 920.3325 969.7964 978.8519 989.9595 992.1699 996.8959 1006.3236 1030.3387 1054.3489 1063.5554 1068.7058 1083.5293 1112.7150 1120.5022 1141.1044 1157.0290 1170.2873 1180.8388 1189.5558 1216.0245 1221.1527 1236.8135 1275.1242 1294.9215 1322.4595 1327.5655 1330.3826 1343.5998 1374.4901 1381.6604 1384.9836 1390.2936 1396.1661 1439.2503 1452.8317 1456.9128 1464.6241 1473.9656 1476.3329 1480.2409 1482.7920 1485.9448 1491.9377 1591.2710 1614.4570 2863.7852 2920.3782 2925.8276 2975.3004 2975.9508 2992.0273 2999.5172 2999.9136 3015.2456 3041.7511 3049.2400 3077.8285 3079.5070 3097.6840 3110.5389 3112.9474 3122.6074 3136.2459 3153.0757 3164.8875
redmass: 3.8915 3.9115 3.1478 1.9837 3.0468 3.3068 3.2292 2.7179 3.2287 1.6545 1.6388 1.1343 3.4671 2.4484 3.1655 3.7689 2.8560 2.8369 2.6772 4.0959 3.5515 3.7470 2.8354 6.2338 1.8123 2.5315 1.0984 2.3190 2.4371 2.4798 1.2508 1.1906 2.4647 1.8202 1.3739 2.2714 1.4182 5.3639 2.9523 1.5605 2.9669 2.0824 2.6951 2.2217 2.3980 1.6042 2.3340 2.4213 1.4309 2.3092 1.0621 1.1823 1.1292 2.0197 1.3030 1.1854 1.1095 1.2529 1.3439 1.2095 1.3828 1.4331 1.4668 3.5179 1.4679 1.2531 1.3177 1.9776 1.1609 1.0452 1.0507 1.0708 1.1903 1.0448 1.0946 1.8280 1.0863 6.0236 6.0789 1.0834 1.0588 1.0634 1.0835 1.0365 1.0788 1.0538 1.0435 1.0940 1.1003 1.1014 1.1024 1.0991 1.1000 1.0868 1.1002 1.0868 1.0929 1.0965 1.0992
irintensity: 0.0066 0.0208 0.7422 0.0668 0.1329 1.4115 0.7854 2.9682 12.7700 1.3895 1.1224 0.1557 0.2186 0.5257 3.8023 3.7425 2.2645 0.1019 3.9354 1.1298 5.6277 1.4822 11.7284 0.6524 51.1062 35.6654 10.5996 24.7744 38.5032 30.8567 0.4702 10.6617 64.9763 6.1337 5.2553 39.3272 3.9062 49.3425 76.8076 5.8978 39.7808 14.6847 19.6483 65.6183 66.1755 7.3724 100.4855 36.7674 5.0491 12.3102 0.3431 3.9589 0.8479 0.1725 2.1405 6.0649 2.0403 10.3269 7.8343 39.5327 32.9339 2.1748 1.5029 2.5556 11.8725 39.9668 1.4659 5.2443 14.4240 6.6429 5.5425 4.5435 2.4804 12.6163 2.7445 25.4118 14.6521 0.6942 8.0284 62.6337 39.2241 103.2079 17.8695 35.5021 74.3566 12.7771 26.7961 25.6008 25.4696 0.9833 86.5279 50.0226 33.6292 9.6441 21.8189 1.9001 36.0497 27.1955 14.1070
temp: 298.150 k
press: 1.00000 atm
elementType: 8 8 6 6 6 6 6 6 6 6 6 6 6 6 6 1 1 1 1 1 1 1 1 1 1 1 1 1 1 1 1 1 1 1 1
symmnumber: 1
zpe: 789576.1 jmol-1
zpe.correction: 0.300734 hartree
zpe.thermalcorrener: 0.317490 hartree
zpe.thermalcorrenthalpy: 0.318434 hartree
zpe.thermalcorrgfe: 0.251574 hartree
zpe.sumelectzpe: -656.635753 hartree
zpe.sumelectthermal: -656.618997 hartree
zpe.sumelectthermalent: -656.618053 hartree
zpe.sumelectthermalfe: -656.684913 hartree
dipole: -0.5696 -0.5793 -2.3242
dipole: 2.4621
quadrupole: -86.7007 -91.9647 -86.0051
quadrupole: 3.5093 1.3708 2.0098
quadrupole: 1.5228 -3.7412 2.2184 3.5093 1.3708 2.0098
hfenergy: -656.9364871 hartree
pointgroup: C01 [X(C13H20O2)]
dipole: 0.2149568 -0.7263385 -0.6037769 debye
polarizability: 186.7946218|4.5695007|115.7588571|-7.3774903|15.9614106|134.5362517 unknown
InChI: InChI=1S/C13H20O2/c1-3-10-14-12(2)15-11-9-13-7-5-4-6-8-13/h4-8,12H,3,9-11H2,1-2H3
charge 0 multiplicity 1
35 atoms
O  0.720438 -0.460927 0.033217
O  2.915003 -0.23477 0.879737
C  -1.175918 -0.519596 -1.50145
C  1.813445 -1.1497 0.761771
C  -0.112446 -1.365274 -0.777019
C  -2.319444 -0.031375 -0.619492
C  3.532098 0.129354 -0.41363
C  4.673787 1.105908 -0.118509
C  1.380981 -1.531313 2.174565
C  -3.658387 -0.39145 -0.919955
C  -2.076767 0.795085 0.510906
C  5.408009 1.540365 -1.405843
C  -4.731952 0.057335 -0.115758
C  -3.1476 1.243072 1.315916
C  -4.479327 0.877775 1.006854
H  -0.649093 0.33854 -1.963986
H  -1.587041 -1.128281 -2.329715
H  2.111685 -2.043087 0.155644
H  0.529462 -1.885962 -1.522951
H  -0.597652 -2.131358 -0.135122
H  2.765733 0.589981 -1.067352
H  3.916179 -0.791232 -0.909898
H  4.25618 1.988406 0.401104
H  5.38197 0.62672 0.583584
H  1.12825 -0.616422 2.735444
H  2.196288 -2.058357 2.699587
H  0.492552 -2.185904 2.144011
H  -3.863312 -1.026229 -1.791714
H  -1.044892 1.068478 0.753399
H  4.720618 2.045914 -2.10999
H  6.226979 2.244003 -1.172847
H  5.849974 0.671811 -1.93012
H  -5.759553 -0.231233 -0.365678
H  -2.943876 1.880125 2.184614
H  -5.30837 1.229301 1.631676
