program: Gaussian 09
title: 000061402
version: EM64L-G09RevD.01
frameworkgroup: C1[X(C13H16O2)]
method: RPBEPBE
basis: SDD
operation: Freq
keyword: #pfreq=noraman
keyword: PBEPBE/SDD
title: #p freq=noraman PBEPBE/SDD
converged: YES YES NO NO
title: Mulliken charges:
elementType: O O C C C C C C C C C C C C C H H H H H H H H H H H H H H H H
charge: -0.288673 -0.277527 0.078533 0.331182 0.478923 -0.417590 0.184866 -0.823189 -0.825699 -0.753232 -0.369296 -0.435447 -0.223321 -0.221060 -0.236284 0.245099 0.228839 0.277982 0.223917 0.224742 0.258210 0.238069 0.237172 0.248204 0.246824 0.210294 0.239210 0.234092 0.227205 0.228097 0.229858
chargesum: 0.00000
title: Mulliken charges with hydrogens summed into heavy atoms:
elementType: O O C C C C C C C C C C C C C
charge: -0.288673 -0.277527 0.078533 0.331182 0.478923 0.056349 0.184866 -0.096548 -0.092249 -0.047910 -0.130086 -0.201355 0.003883 0.007037 -0.006427
polarizability: 1.87832064e+02 -1.13625932e+01 1.45736166e+02 1.07743601e+01 7.20646527e+00 1.11247828e+02
1716.lowfreq: -18.9391 -6.1478 -0.0010 -0.0006 -0.0003 2.4867 4.6748 17.6618 22.2148
frequency: -11.2739 13.7810 20.3683 47.9987 91.5044 105.2012 144.4789 156.8917 164.6376 189.1021 229.3669 268.2686 305.9897 312.9971 362.5318 390.2048 394.2130 402.9607 480.8716 513.4518 524.4165 572.5150 580.4636 616.6896 702.2786 725.5760 745.7381 753.3065 829.6573 853.0497 869.2773 901.4748 918.2539 943.7572 972.9849 976.6277 980.2722 990.7907 996.8803 1004.0634 1026.6310 1039.7582 1069.1603 1078.8042 1087.0883 1141.2607 1172.6139 1178.6496 1187.3542 1190.0933 1226.0669 1291.9053 1320.9121 1352.2689 1385.6815 1386.5888 1395.2114 1399.2558 1439.7941 1451.0352 1458.5180 1463.4314 1468.3321 1472.6455 1483.5876 1486.8724 1502.7409 1575.4311 1595.5712 1617.2446 1631.7811 2967.4769 2983.6598 2991.5505 3007.0099 3034.0113 3060.8617 3067.9568 3078.7091 3090.0674 3109.3452 3120.1361 3120.3044 3124.2464 3136.4558 3147.8805 3164.1410
redmass: 3.4541 3.0709 2.9206 4.2596 2.0623 1.8043 3.5770 1.1094 2.6463 1.1709 5.7123 3.4984 2.7954 2.9309 3.1918 3.1303 3.2351 2.8013 3.4794 3.0069 4.5297 4.3134 4.1767 6.3387 1.8724 6.3694 4.8992 1.8623 3.4281 1.2552 3.7661 3.1643 1.6671 1.2549 1.8204 1.3949 1.3758 6.1694 1.3305 1.7117 2.1565 1.4043 3.1266 1.7275 1.5402 2.3342 1.0552 4.5270 1.1294 1.1262 2.2591 3.1904 1.3877 1.6192 1.7608 2.5073 1.2142 1.1808 2.1665 1.1209 1.0477 1.0728 1.0495 1.1039 1.0617 2.3356 1.0470 9.9898 6.1507 6.1458 6.8893 1.0402 1.0384 1.0365 1.0573 1.0956 1.0985 1.1066 1.0963 1.1008 1.0968 1.0860 1.0952 1.0872 1.0918 1.0964 1.1017
irintensity: 1.7880 0.3078 0.0321 0.7678 0.1446 1.6300 1.0700 1.8403 3.1051 1.6927 2.9212 3.2039 1.9986 0.9565 6.8419 4.4035 6.1019 0.5342 9.2961 5.5148 3.7201 11.8903 1.4170 0.1298 46.8595 8.6878 14.6431 59.1030 8.8747 0.2611 3.3060 59.2323 5.1602 0.4070 1.4123 0.1323 8.1493 1.4636 0.3666 25.2252 5.5187 3.3853 400.7523 4.9078 7.8385 9.6800 0.0906 49.6769 0.7742 4.1365 5.1641 128.1393 6.9590 5.3811 20.8090 13.6517 43.0850 6.4271 8.8395 3.6827 12.2136 13.3589 21.5143 13.1659 26.7654 7.0104 4.8300 227.9482 2.5383 1.3165 113.9766 19.5973 34.5980 20.1250 19.1230 17.1145 23.0178 15.1227 13.7051 28.9837 5.8027 6.1647 20.7116 0.8157 16.0091 40.9682 20.0554
temp: 298.150 k
press: 1.00000 atm
elementType: 8 8 6 6 6 6 6 6 6 6 6 6 6 6 6 1 1 1 1 1 1 1 1 1 1 1 1 1 1 1 1
symmnumber: 1
zpe: 668909.9 jmol-1
zpe.correction: 0.254774 hartree
zpe.thermalcorrener: 0.269814 hartree
zpe.thermalcorrenthalpy: 0.270758 hartree
zpe.thermalcorrgfe: 0.210176 hartree
zpe.sumelectzpe: -654.305013 hartree
zpe.sumelectthermal: -654.289974 hartree
zpe.sumelectthermalent: -654.289029 hartree
zpe.sumelectthermalfe: -654.349612 hartree
dipole: -0.5740 2.9129 -0.3574
dipole: 2.9903
quadrupole: -77.9198 -93.7106 -85.5296
quadrupole: 5.8499 1.2498 3.7483
quadrupole: 7.8002 -7.9906 0.1904 5.8499 1.2498 3.7483
hfenergy: -654.5597877 hartree
pointgroup: C01[X(C13H16O2)]
dipole: -0.1202652 1.1149909 0.3555881 debye
polarizability: 179.6287922|-23.9179146|138.8426333|14.9525428|14.0038256|126.3446329 unknown
InChI: InChI=1S/C13H16O2/c1-10(2)11(3)13(14)15-9-12-7-5-4-6-8-12/h4-8H,9H2,1-3H3
charge 0 multiplicity 1
31 atoms
O  0.45751 -0.443918 -0.314862
O  1.55741 -2.468035 -0.612085
C  2.806571 -0.605195 0.340476
C  2.878625 0.723529 0.713342
C  -1.95348 -0.235294 -0.556643
C  -0.762381 -1.105524 -0.881502
C  1.59761 -1.265411 -0.229456
C  3.998982 -1.551925 0.475229
C  4.163562 1.296168 1.285892
C  1.759333 1.748972 0.61091
C  -2.31707 0.01133 0.792749
C  -2.740962 0.323045 -1.592684
C  -3.444265 0.80352 1.097891
C  -3.875946 1.110817 -1.290233
C  -4.229413 1.354041 0.056135
H  -0.833512 -2.115176 -0.43716
H  -0.618802 -1.222097 -1.970555
H  3.722072 -2.550429 0.103893
H  4.321038 -1.65508 1.52802
H  4.868888 -1.199653 -0.109007
H  4.975202 0.561596 1.388126
H  4.524188 2.126244 0.645948
H  3.966199 1.738856 2.282567
H  0.892923 1.469201 1.235812
H  1.364875 1.824843 -0.416686
H  2.119733 2.742436 0.930646
H  -1.709498 -0.414979 1.599746
H  -2.465536 0.142871 -2.639113
H  -3.715348 0.988534 2.143431
H  -4.478166 1.535131 -2.101292
H  -5.107242 1.965682 0.292967
