program: Gaussian 09
title: 000061401
version: EM64L-G09RevD.01
frameworkgroup: C1[X(C12H22O2)]
method: RPBEPBE
basis: SDD
operation: Freq
keyword: #pfreq=noraman
keyword: PBEPBE/SDD
title: #p freq=noraman PBEPBE/SDD
converged: YES YES NO NO
title: Mulliken charges:
elementType: O O C C C C C C C C C C C C H H H H H H H H H H H H H H H H H H H H H H
charge: -0.256569 -0.171880 0.014960 -0.404812 -0.429442 -0.466763 -0.750521 -0.291621 -0.322884 0.399921 -0.240086 -0.806796 -0.798232 -0.063163 0.250354 0.189297 0.187176 0.220628 0.190306 0.194930 0.197064 0.202828 0.205062 0.219124 0.190571 0.200344 0.208602 0.208900 0.207855 0.283106 0.204103 0.202324 0.217321 0.210293 0.239187 0.158514
chargesum: 0.00000
title: Mulliken charges with hydrogens summed into heavy atoms:
elementType: O O C C C C C C C C C C C C
charge: -0.256569 -0.171880 0.265314 -0.028339 -0.018508 -0.074769 -0.123507 0.099293 -0.114282 0.399921 0.176668 -0.117263 -0.131431 0.095351
polarizability: 1.49859231e+02 1.10820238e+01 1.48165621e+02 -1.08445840e+00 2.06664524e+00 1.11413590e+02
1716.lowfreq: -8.7583 0.0003 0.0005 0.0010 3.6366 8.0087 13.5456 34.4744 47.9623
frequency: 6.9614 34.4039 47.8589 59.1420 74.5676 82.8486 104.6639 127.8811 141.6669 167.3191 182.8234 202.3481 207.6961 234.7545 267.5998 291.0221 306.0932 325.0038 347.5058 378.5040 405.3228 447.2479 492.7341 511.6225 527.4828 669.6326 715.8154 738.6831 770.5340 812.2742 839.2384 858.4101 877.6942 886.7018 938.1197 949.8598 954.2528 971.1242 1000.3961 1006.2408 1029.9751 1048.7404 1055.2072 1088.0086 1092.7299 1100.5148 1104.3801 1126.2040 1147.7942 1173.8032 1190.7991 1205.2912 1208.1076 1232.8938 1261.6328 1301.9930 1309.7387 1319.7213 1327.0771 1354.9252 1356.9585 1360.5380 1380.4273 1384.1414 1388.1160 1389.5114 1401.4537 1435.4385 1443.5760 1453.9656 1460.6988 1462.6315 1471.4538 1473.5916 1475.8094 1477.7799 1479.2093 1488.7818 1662.4171 1694.1814 2845.9153 2875.3453 2902.2983 2921.7379 2946.0928 2956.7142 2962.8016 2964.8771 2966.6899 2967.9754 2976.7682 2996.6679 3012.0905 3031.4061 3032.8437 3043.7637 3047.2969 3056.7433 3060.1948 3065.8364 3075.8201 3085.9668
redmass: 3.8354 4.0914 4.3407 3.1771 3.3008 2.9011 4.8110 1.3847 2.0400 2.2790 1.4390 1.3770 1.5049 2.1122 1.9902 3.8469 2.5012 2.2808 2.4350 2.1394 2.1612 2.3809 2.2506 2.5818 2.7304 4.7254 1.2562 2.0134 2.4935 1.6736 1.7037 2.1405 2.3305 1.7955 1.6456 1.9801 1.4035 2.0982 1.2512 1.8325 1.8169 2.2647 1.8041 1.6543 1.7465 5.2095 1.9383 2.1869 2.0222 1.5108 1.1321 1.1837 1.4400 1.8766 1.3858 1.3363 1.1843 1.3452 1.2705 1.4401 1.5496 1.4711 1.3322 1.2134 1.2769 1.2619 1.2321 1.1099 1.0855 1.0500 1.0828 1.0708 1.0634 1.0672 1.0554 1.0624 1.0827 1.0638 8.0161 6.4346 1.0762 1.0626 1.0985 1.0545 1.0606 1.0366 1.0451 1.0634 1.0542 1.0628 1.0825 1.0911 1.0909 1.0967 1.0942 1.0968 1.0963 1.0976 1.0910 1.0983 1.0980 1.0972
irintensity: 0.8381 3.0059 2.0069 6.2316 4.8507 0.6233 9.5664 1.8820 2.6257 1.5130 1.5003 0.3064 0.0638 1.2551 0.8697 2.3961 1.0826 0.3152 1.1749 1.0454 1.2605 7.7106 1.4165 2.0637 1.1707 19.6199 1.0018 3.5017 2.4667 13.0658 12.6868 4.2174 26.8042 10.4776 3.3908 42.4227 2.4335 6.4791 4.8257 0.6276 5.1055 18.0446 1.9630 5.1092 20.8517 74.5807 2.7018 6.2300 6.9183 7.8391 0.2928 4.6111 0.3694 2.9865 2.9737 3.5053 0.6897 12.1967 2.6671 0.7856 0.2563 3.9768 7.4633 12.7475 23.0214 21.3291 9.5563 16.4644 7.5054 1.7769 8.4550 0.3971 5.7551 4.5774 27.4586 14.0985 13.3808 15.7288 130.0111 5.8823 69.5753 185.6049 41.5496 75.0334 30.9298 42.8766 24.5083 33.9283 83.7284 38.0732 72.3782 4.8115 25.9961 23.5601 20.5392 36.1760 26.4489 57.0209 32.0888 52.9505 56.1176 36.1699
temp: 298.150 k
press: 1.00000 atm
elementType: 8 8 6 6 6 6 6 6 6 6 6 6 6 6 1 1 1 1 1 1 1 1 1 1 1 1 1 1 1 1 1 1 1 1 1 1
symmnumber: 1
zpe: 822911.8 jmol-1
zpe.correction: 0.313431 hartree
zpe.thermalcorrener: 0.331257 hartree
zpe.thermalcorrenthalpy: 0.332201 hartree
zpe.thermalcorrgfe: 0.265179 hartree
zpe.sumelectzpe: -619.724246 hartree
zpe.sumelectthermal: -619.706419 hartree
zpe.sumelectthermalent: -619.705475 hartree
zpe.sumelectthermalfe: -619.772497 hartree
dipole: 2.3171 -4.0444 -0.2358
dipole: 4.6671
quadrupole: -76.8264 -88.4289 -86.4500
quadrupole: -7.5701 -0.2698 1.1553
quadrupole: 7.0753 -4.5271 -2.5482 -7.5701 -0.2698 1.1553
hfenergy: -620.0376764 hartree
pointgroup: C01 [X(C12H22O2)]
dipole: 1.4749542 -1.0429198 -0.3291648 debye
polarizability: 139.4217047|7.5897392|157.1449563|-6.7624822|-0.5858533|112.871781 unknown
InChI: InChI=1S/C12H22O2/c1-11(2)5-4-6-12(3)7-9-14-10-8-13/h5,8,12H,4,6-7,9-10H2,1-3H3
charge 0 multiplicity 1
36 atoms
O  1.677727 -0.098746 -0.725083
O  2.057975 2.62007 -0.128423
C  -0.494066 -1.887318 0.378572
C  -2.040871 -2.00436 0.297164
C  0.152992 -1.96356 -1.030673
C  -2.764101 -0.769643 -0.320964
C  0.072136 -2.978034 1.31925
C  1.623209 -1.533233 -1.074894
C  -2.566071 0.490948 0.499119
C  -1.944869 1.648823 0.128644
C  3.02571 0.401708 -0.639073
C  -1.326553 1.908153 -1.233449
C  -1.780421 2.79641 1.113427
C  3.051786 1.880696 -0.290893
H  -0.254827 -0.891294 0.799812
H  -2.434385 -2.157098 1.323638
H  -2.312707 -2.914808 -0.279504
H  -0.402938 -1.318602 -1.736458
H  0.083456 -3.002994 -1.415427
H  -3.847376 -1.008052 -0.375192
H  -2.43066 -0.617949 -1.363918
H  -0.180093 -3.991072 0.947148
H  1.172544 -2.918414 1.415835
H  -0.352496 -2.877698 2.335324
H  2.241139 -2.115245 -0.355446
H  2.047122 -1.679037 -2.093491
H  -2.950586 0.428453 1.530938
H  3.62584 -0.133592 0.138833
H  3.587316 0.27999 -1.59979
H  -0.224781 1.956959 -1.136711
H  -1.571503 1.132123 -1.977478
H  -1.665805 2.884426 -1.633057
H  -2.193221 2.550635 2.107979
H  -2.28466 3.713325 0.747263
H  -0.707882 3.049637 1.229831
H  4.09762 2.277296 -0.189953
