program: Gaussian 09
title: 000061389
version: EM64L-G09RevD.01
frameworkgroup: C1[X(C16H10O10S3)]
method: RPBEPBE
basis: SDD
operation: Freq
keyword: #p
keyword: freq=noraman
keyword: PBEPBE/SDD
title: #p freq=noraman PBEPBE/SDD
converged: YES YES NO NO
title: Mulliken charges:
elementType: S S S O O O O O O O O O O C C C C C C C C C C C C C C C C H H H H H H H H H H
charge: 0.974522 0.975652 0.972074 -0.378168 -0.556345 -0.559434 -0.557023 -0.483036 -0.483584 -0.480935 -0.488352 -0.487550 -0.484663 0.028986 0.055202 0.709825 0.701200 0.685304 0.456363 -0.417891 -0.416842 -0.372661 -0.480732 -0.501974 -0.469471 -0.358866 -0.440715 0.030447 -0.468709 0.292315 0.294852 0.291688 0.346617 0.201578 0.325600 0.378399 0.389024 0.388354 0.388950
chargesum: 0.00000
title: Mulliken charges with hydrogens summed into heavy atoms:
elementType: S S S O O O O O O O O O O C C C C C C C C C C C C C C C C
charge: 0.974522 0.975652 0.972074 0.000230 -0.167322 -0.171080 -0.168073 -0.483036 -0.483584 -0.480935 -0.488352 -0.487550 -0.484663 0.028986 0.055202 0.709825 0.701200 0.685304 0.456363 -0.417891 -0.416842 -0.372661 -0.188417 -0.207123 -0.177783 -0.012249 -0.239137 0.030447 -0.143109
polarizability: 4.82234683e+02 -2.26541081e+01 3.56754874e+02 -2.38111387e+00 2.95062801e+00 1.56747891e+02
1716.lowfreq: -6.0171 0.0015 0.0018 0.0025 3.3516 5.5939 26.0474 35.0993 38.0062
frequency: 26.0073 35.0977 37.9959 38.5041 49.8548 67.0639 85.2905 97.4264 106.2768 118.3331 139.0921 147.8938 172.6135 176.3198 179.6183 191.9675 198.1158 205.8544 214.1541 222.4223 233.9112 240.2010 248.2087 266.8166 272.0574 280.8041 297.7427 310.3196 315.1424 324.2152 328.1876 331.4511 332.3040 341.2439 400.6260 403.7895 406.1494 413.6395 423.8322 455.0355 505.4088 509.4623 518.7548 532.2591 535.3271 552.2545 564.2881 567.2328 575.8226 627.7112 629.9628 635.7959 650.5040 682.2693 730.5798 739.8927 762.2045 788.9799 799.1467 830.4812 833.1441 840.4365 856.8099 884.7891 903.7658 929.8366 940.0160 960.1492 964.5877 966.1912 969.1472 979.1066 986.8610 1002.6316 1045.0998 1045.3383 1048.6240 1091.7240 1120.7848 1131.0708 1183.6602 1193.3169 1198.0482 1225.3782 1234.3444 1310.0952 1331.8826 1372.0740 1380.0737 1392.0236 1399.4974 1410.4243 1436.2217 1464.5587 1485.5158 1506.3555 1536.0969 1583.5536 1597.2581 1615.0202 1626.7270 3112.5216 3127.3367 3167.2534 3169.1821 3178.1377 3187.2298 3476.4817 3478.5555 3478.8333 3587.0195
redmass: 10.2285 10.4516 10.4175 9.9712 7.6920 5.5937 9.7939 7.8030 9.7852 6.9199 9.9699 6.3865 3.0835 2.7534 2.5715 4.1482 5.2306 5.2629 5.0450 2.6017 2.9510 2.5236 3.8287 3.0548 4.6172 4.5159 4.3605 7.2047 7.7942 6.4610 8.5136 2.7231 2.8721 8.0682 9.6929 10.0360 11.2861 5.9186 9.2577 8.5203 5.9276 3.9813 7.2042 7.2848 9.8272 7.1111 9.6088 7.3649 6.7049 5.1751 6.1162 5.6645 4.9969 7.0759 6.1828 5.0652 1.6700 7.0880 5.6826 8.6374 13.5186 11.9974 1.9354 2.0878 7.6995 1.8491 1.4927 5.1156 7.5083 6.7376 2.8343 3.7635 1.8039 2.9983 1.1628 1.1698 1.1672 3.7687 2.5840 1.7366 1.8552 1.7369 1.8385 3.8826 1.4032 2.1610 2.2468 3.2940 2.6515 4.9112 5.1539 3.7793 5.3976 3.3460 4.2578 4.1761 8.4912 6.6991 8.5721 6.6807 6.6492 1.0894 1.0923 1.0924 1.0891 1.0953 1.0978 1.0662 1.0662 1.0662 1.0658
irintensity: 0.9829 0.4530 0.6959 0.9562 0.0356 0.7825 0.8135 0.1937 0.7202 2.9058 0.6607 2.8982 34.5847 26.3896 15.4414 24.0275 4.6652 3.3121 28.9886 10.1251 47.3652 10.2279 3.1187 78.9509 8.2042 4.1523 43.1378 23.8110 19.0191 50.8001 37.3524 49.8329 45.8479 2.0206 75.3531 61.3540 134.4773 34.2784 63.4897 7.0117 20.7458 30.7752 97.8132 16.2785 72.6930 117.7735 75.2837 15.0036 89.8729 6.0949 17.2176 39.0518 28.5797 3.1253 6.7504 0.0835 19.6001 12.7361 12.4019 90.8046 80.3816 33.4804 24.4529 67.1870 53.9444 1.3334 38.1764 48.2066 53.5608 27.5273 64.3005 27.7473 7.5165 5.0380 119.5336 84.7817 82.2524 33.5164 67.4986 275.0042 68.0634 8.0945 7.9532 50.2411 32.9156 17.7709 2.0771 29.0836 14.3046 24.4557 54.4664 12.6986 17.2135 12.8478 2.4062 128.4082 65.9664 18.7297 7.4126 72.5853 97.4269 15.5116 45.5210 22.6711 10.4385 6.5186 1.1640 56.6639 74.5676 42.7353 70.0500
temp: 298.150 k
press: 1.00000 atm
elementType: 16 16 16 8 8 8 8 8 8 8 8 8 8 6 6 6 6 6 6 6 6 6 6 6 6 6 6 6 6 1 1 1 1 1 1 1 1 1 1
symmnumber: 1
zpe: 620973.8 jmol-1
zpe.correction: 0.236516 hartree
zpe.thermalcorrener: 0.265016 hartree
zpe.thermalcorrenthalpy: 0.265960 hartree
zpe.thermalcorrgfe: 0.177476 hartree
zpe.sumelectzpe: -2559.552061 hartree
zpe.sumelectthermal: -2559.523562 hartree
zpe.sumelectthermalent: -2559.522618 hartree
zpe.sumelectthermalfe: -2559.611102 hartree
dipole: 1.7083 -4.2366 1.2504
dipole: 4.7361
quadrupole: -231.0698 -170.8000 -196.3140
quadrupole: 6.9269 4.3321 -10.8962
quadrupole: -31.6752 28.5946 3.0806 6.9269 4.3321 -10.8962
hfenergy: -2559.7885777 hartree
pointgroup: C01 [X(C16H10O10S3)]
dipole: 0.7225629 1.6295086 -0.5427739 debye
polarizability: 483.5684444|18.6370059|355.4321901|0.357372|-2.962897|156.7368126 unknown
InChI: InChI=1S/C16H10O10S3/c17-11-5-12(27(18,19)20)8-3-4-10-14(29(24,25)26)6-13(28(21,22)23)9-2-1-7(11)15(8)16(9)10/h1-6,17-18,21,24H
charge 0 multiplicity 1
39 atoms
S  -2.622437 -3.311162 -0.00595
S  -4.249252 1.929516 -0.006743
S  4.874877 -0.954434 0.030842
O  3.09864 3.832521 0.002648
O  -2.106546 -3.631499 1.747276
O  -4.025853 2.461946 -1.772692
O  4.647075 -1.51458 -1.722425
O  -4.232535 -3.338522 -0.126131
O  -1.728313 -4.25295 -0.971534
O  -5.595881 1.05141 0.140119
O  -4.028528 3.23055 0.932287
O  6.213915 -0.060392 0.155909
O  4.673871 -2.235912 0.998498
C  -0.377592 0.260326 0.001314
C  0.9977 0.688876 0.007555
C  -0.687971 -1.158021 0.000885
C  -1.439005 1.248219 -0.002825
C  2.051725 -0.301638 0.01393
C  1.308315 2.098176 0.00026
C  -2.063461 -1.511749 -0.003303
C  -2.773202 0.763706 -0.002723
C  3.379724 0.201437 0.01706
C  0.389622 -2.114038 0.007294
C  -1.095488 2.649604 -0.007477
C  1.708122 -1.700304 0.017244
C  -3.114213 -0.591751 -0.004595
C  0.226607 3.048143 -0.00837
C  2.678792 2.507865 0.004575
C  3.717439 1.553403 0.006098
H  0.157159 -3.180952 -0.004678
H  -1.893233 3.395528 0.00288
H  2.507217 -2.445236 0.036316
H  -4.161175 -0.920253 -0.005026
H  0.430674 4.126419 -0.014034
H  4.760676 1.882961 0.006638
H  2.348947 4.477636 0.006237
H  -2.331066 -4.582935 1.966312
H  -4.789228 3.065722 -2.010077
H  5.364983 -2.182435 -1.928096
