program: Gaussian 09
title: 000073495
version: EM64L-G09RevD.01
frameworkgroup: C1[X(C15H22O5)]
method: RPBEPBE
basis: SDD
operation: Freq
keyword: #pfreq=noraman
keyword: PBEPBE/SDD
title: #p freq=noraman PBEPBE/SDD
converged: YES YES NO NO
title: Mulliken charges:
elementType: O O O O O C C C C C C C C C C C C C C C H H H H H H H H H H H H H H H H H H H H H H
charge: -0.323140 -0.255654 -0.448019 -0.426874 -0.469369 0.234414 0.290237 0.187451 -0.216363 -0.147053 -0.481602 -0.198438 -0.094879 -0.806251 -0.477355 -0.417158 -0.448600 -0.558006 0.455733 -0.825184 0.258658 0.178701 0.229405 0.238462 0.290207 0.216820 0.243361 0.279646 0.190357 0.238951 0.227403 0.229164 0.207576 0.227767 0.214398 0.229131 0.353353 0.326638 0.367609 0.221582 0.232815 0.224104
chargesum: 0.00000
title: Mulliken charges with hydrogens summed into heavy atoms:
elementType: O O O O O C C C C C C C C C C C C C C C
charge: -0.323140 -0.255654 -0.094665 -0.100236 -0.101760 0.234414 0.290237 0.187451 0.042295 0.031648 -0.013735 0.091769 0.121941 -0.092886 -0.011000 0.019582 -0.220833 -0.114477 0.455733 -0.146683
polarizability: 2.04834414e+02 -7.52204459e+00 1.50042089e+02 9.43243368e+00 -2.81389972e+00 1.49677305e+02
1716.lowfreq: -9.5838 -5.8235 -0.0003 0.0007 0.0009 17.9185 56.4817 71.1277 91.8743
frequency: 56.3859 71.0398 91.8587 116.6917 146.8950 162.9638 170.4652 203.5896 205.2663 225.6747 235.3368 240.3889 243.2145 250.4809 264.6454 271.4437 286.0103 293.2682 322.3691 324.8934 341.0494 343.7157 388.1613 402.2456 427.0247 444.1100 452.8511 480.6167 495.6006 520.9933 530.1615 551.2440 565.2533 590.6845 647.9094 665.9104 725.4133 755.6166 758.5220 813.9073 825.5890 844.2203 872.5548 879.5740 901.6608 922.0296 926.1315 942.4147 948.1253 973.8070 981.6028 1000.4427 1008.6413 1016.4601 1026.0178 1033.0539 1051.1691 1054.6450 1070.6031 1089.5632 1092.6809 1119.0897 1122.5805 1136.6813 1146.9262 1173.7640 1176.2376 1187.1219 1202.8893 1210.6244 1222.1468 1240.1505 1249.2204 1270.4421 1276.1124 1288.1729 1308.2221 1315.4187 1318.5214 1341.9894 1353.3980 1359.3057 1366.9216 1374.7129 1379.0162 1389.8477 1393.1578 1398.8600 1407.3028 1449.5963 1459.0417 1462.8206 1469.5935 1470.7005 1479.6420 1486.7129 1505.8281 1696.8597 2868.7722 2955.4648 2958.9833 2961.9845 2976.1909 2987.6689 2999.8270 3021.6678 3032.3575 3032.8267 3051.4293 3065.5908 3070.3718 3082.0452 3082.4078 3093.3282 3101.4344 3117.8893 3176.5684 3352.7497 3536.4876 3556.6134
redmass: 5.9570 3.5305 6.9005 2.9885 4.6397 1.2786 4.2073 2.8161 4.3672 3.0886 1.9139 1.6758 4.5531 3.2172 2.5829 1.8676 1.9302 3.3414 2.3430 1.2104 2.8638 3.1964 3.9214 4.4980 2.7990 3.8727 3.8867 2.7753 2.8392 1.9834 2.1015 3.6471 4.7258 4.8185 3.7062 3.8273 2.8636 3.5579 2.6212 2.7851 3.0960 1.9629 5.4366 2.0377 2.4358 2.1495 2.0709 2.2876 2.5269 2.5747 4.2752 2.9150 3.0495 1.9755 3.3571 1.7963 1.3852 2.2627 2.4547 2.3076 2.3848 1.9577 1.9572 1.5284 2.1665 2.7240 1.8965 1.8554 1.3458 1.5593 2.2224 1.2408 1.5121 1.3306 1.4643 1.5389 1.2244 1.2374 1.3280 1.4256 1.3009 1.8300 1.7902 1.4265 1.6400 1.2514 1.2407 1.2574 1.2113 1.0863 1.0644 1.0647 1.0729 1.1841 1.0788 1.0702 1.0619 6.8044 1.0816 1.0584 1.0823 1.0420 1.0384 1.0585 1.0923 1.0665 1.1028 1.0980 1.0887 1.0928 1.0569 1.0987 1.0998 1.1012 1.0872 1.0908 1.1184 1.0693 1.0661 1.0658
irintensity: 1.9754 0.7694 15.5859 0.9393 11.8126 0.0950 1.4534 1.9020 11.1053 2.4049 8.4222 5.2926 8.7729 2.5658 28.2129 13.4631 16.0975 10.4633 2.4236 152.4348 7.2761 3.4534 4.5082 25.9818 9.5465 2.3316 1.5123 30.3118 15.4424 33.1729 54.6218 5.4941 1.6861 19.1973 23.8424 9.7887 1.3188 4.1873 5.2674 2.7824 1.4140 11.7505 28.3856 1.9102 5.9107 6.3734 6.9063 55.5575 103.6959 29.4710 25.3558 49.5954 101.1500 18.6076 19.2246 8.0193 9.8586 32.1611 4.0373 5.4320 5.0666 8.0414 4.6190 10.8522 22.8340 3.6239 12.7789 4.0455 23.8982 5.5858 1.1146 7.7410 8.1712 11.4496 2.6450 3.7895 34.3008 15.5183 1.1173 17.4225 3.1336 1.4082 17.1020 6.5021 3.7938 7.2908 12.5128 33.3892 19.5396 15.4307 15.5265 7.6668 17.1523 15.9120 9.7973 3.4227 3.6949 13.8952 65.4740 13.4250 21.6993 65.7901 42.4229 61.2300 15.8291 19.2472 36.6477 32.0750 30.5861 9.1602 35.8480 12.7528 34.8535 3.7950 4.7599 23.3757 10.1758 218.0186 6.0017 11.7340
temp: 298.150 k
press: 1.00000 atm
elementType: 8 8 8 8 8 6 6 6 6 6 6 6 6 6 6 6 6 6 6 6 1 1 1 1 1 1 1 1 1 1 1 1 1 1 1 1 1 1 1 1 1 1
symmnumber: 1
zpe: 914169.2 jmol-1
zpe.correction: 0.348189 hartree
zpe.thermalcorrener: 0.367683 hartree
zpe.thermalcorrenthalpy: 0.368627 hartree
zpe.thermalcorrgfe: 0.303455 hartree
zpe.sumelectzpe: -959.244328 hartree
zpe.sumelectthermal: -959.224834 hartree
zpe.sumelectthermalent: -959.223890 hartree
zpe.sumelectthermalfe: -959.289062 hartree
dipole: -2.8486 -1.4770 1.6316
dipole: 3.5998
quadrupole: -96.2966 -138.1248 -122.5268
quadrupole: -6.5774 0.6395 -4.6861
quadrupole: 22.6861 -19.1421 -3.5441 -6.5774 0.6395 -4.6861
hfenergy: -959.592517 hartree
pointgroup: C01 [X(C15H22O5)]
dipole: -1.1396858 0.5993441 -0.5896868 debye
polarizability: 204.264241|8.5837083|150.5251259|-10.0715863|-3.0566288|149.7644414 unknown
InChI: InChI=1S/C15H22O5/c1-8-3-4-14(6-16)9(5-8)20-12-10(17)11(18)13(14,2)15(12)7-19-15/h5,9-12,16-18H,3-4,6-7H2,1-2H3
charge 0 multiplicity 1
42 atoms
O  -1.447799 -2.026063 1.257231
O  0.089609 0.678331 1.711725
O  -1.198167 1.838029 -2.050204
O  -2.937093 2.472743 0.720468
O  0.463387 -3.025668 -0.499431
C  -1.025419 -0.371046 -0.783531
C  -1.652792 -0.679461 0.602147
C  0.573231 -0.435831 -0.569587
C  -1.357524 0.571222 1.43259
C  -1.705159 1.046585 -0.9397
C  -2.829673 -1.574041 0.837135
C  -1.692668 1.738316 0.451928
C  0.942719 -0.299138 0.954484
C  -1.499016 -1.243374 -1.966995
C  1.317057 0.666017 -1.377747
C  1.130638 -1.828798 -1.023328
C  2.365767 0.130238 1.21739
C  2.849582 0.623252 -1.193687
C  3.254107 0.531128 0.267923
C  4.686405 0.890223 0.605004
H  -1.896737 0.634753 2.392905
H  -2.780445 0.808156 -1.139431
H  -3.50382 -1.385401 1.681883
H  -3.250945 -2.141354 -0.00033
H  -0.904538 2.500682 0.540615
H  0.789637 -1.285011 1.442427
H  -1.054266 -0.862553 -2.902709
H  -1.217991 -2.302813 -1.847082
H  -2.597159 -1.17427 -2.085814
H  0.957324 1.652947 -1.043081
H  1.053191 0.594447 -2.448152
H  2.194545 -1.889228 -0.725472
H  1.084051 -1.897422 -2.126868
H  2.672014 0.086512 2.270652
H  3.288839 1.54068 -1.635752
H  3.304045 -0.218659 -1.75728
H  -1.755674 2.65373 -2.125952
H  -3.707859 1.850331 0.670072
H  -0.188631 -2.804187 0.226222
H  5.398983 0.266989 0.028595
H  4.904142 0.756027 1.678481
H  4.902102 1.943778 0.338257
