program: Gaussian 09
title: 000073064
version: EM64L-G09RevD.01
frameworkgroup: C1[X(C5H9NO4)]
method: RPBEPBE
basis: SDD
operation: Freq
keyword: #pfreq=noraman
keyword: PBEPBE/SDD
title: #p freq=noraman PBEPBE/SDD
converged: YES YES NO NO
title: Mulliken charges:
elementType: O O O O N C C C C C H H H H H H H H H
charge: -0.409888 -0.408627 -0.249696 -0.258605 -0.581350 -0.113435 -0.524520 -0.523403 0.181224 0.200759 0.244710 0.287526 0.287182 0.253935 0.298172 0.267590 0.296936 0.375854 0.375636
chargesum: 0.00000
title: Mulliken charges with hydrogens summed into heavy atoms:
elementType: O O O O N C C C C C
charge: -0.034034 -0.032991 -0.249696 -0.258605 -0.016824 0.131275 0.050188 0.028704 0.181224 0.200759
polarizability: 7.62100751e+01 1.37131741e+00 6.99573012e+01 -1.78445457e+00 3.98193469e+00 7.05872244e+01
1716.lowfreq: -13.8166 -5.1791 -0.0006 0.0005 0.0009 8.3736 29.3771 47.0350 56.9113
frequency: 29.3521 47.0145 56.8995 150.5220 174.7668 187.2058 293.3838 309.7283 332.6521 391.9794 458.0566 479.6781 506.7471 518.3770 593.0814 626.1697 640.7829 648.9385 669.2099 800.8758 865.2427 873.0398 912.8234 972.0494 1034.4704 1055.8506 1078.0227 1109.0424 1164.6052 1187.3199 1224.1975 1253.7536 1265.2267 1308.8664 1341.9124 1372.3783 1384.1588 1439.0278 1442.4971 1632.7171 1650.1142 1658.2925 2996.5397 3011.4161 3022.0058 3050.1852 3066.3189 3452.2287 3503.0563 3509.8317 3583.2351
redmass: 8.8641 8.8935 7.0016 2.8337 4.5869 4.8996 1.9899 2.2529 2.2113 3.3446 2.6112 2.4266 1.9799 2.3612 4.2065 1.5814 1.3330 1.4255 2.8750 4.0941 2.8469 3.0984 2.5484 2.0350 2.6828 1.9674 1.6762 2.0656 1.2248 1.7338 1.3450 1.5409 1.8121 1.5445 1.7526 1.5812 1.7106 1.0976 1.0832 1.4608 2.9831 6.3801 1.0625 1.0633 1.0825 1.0977 1.0983 1.0447 1.0639 1.0639 1.0979
irintensity: 0.6855 1.3310 0.4813 1.9748 6.0117 1.2273 26.0080 27.4195 26.4680 5.7906 14.2401 1.5676 52.9158 60.0458 22.6311 124.6614 249.8953 166.5090 48.2742 2.8925 26.5850 2.1994 43.3425 26.8576 219.9601 217.6387 64.0520 10.4375 4.6251 20.0553 19.7790 3.5995 8.0422 45.2414 78.1252 39.4681 53.0934 72.2162 24.7037 66.9165 6.6506 333.0780 20.7833 10.0742 17.3136 3.5330 3.7162 2.6876 18.9790 21.1304 6.4626
temp: 298.150 k
press: 1.00000 atm
elementType: 8 8 8 8 7 6 6 6 6 6 1 1 1 1 1 1 1 1 1
symmnumber: 1
zpe: 384813.8 jmol-1
zpe.correction: 0.146568 hartree
zpe.thermalcorrener: 0.157477 hartree
zpe.thermalcorrenthalpy: 0.158421 hartree
zpe.thermalcorrgfe: 0.108615 hartree
zpe.sumelectzpe: -550.798931 hartree
zpe.sumelectthermal: -550.788021 hartree
zpe.sumelectthermalent: -550.787077 hartree
zpe.sumelectthermalfe: -550.836883 hartree
dipole: 1.1058 -0.4418 -0.3962
dipole: 1.2550
quadrupole: -49.6483 -57.9030 -64.3100
quadrupole: 2.0879 -2.2889 -6.9692
quadrupole: 7.6388 -0.6159 -7.0229 2.0879 -2.2889 -6.9692
hfenergy: -550.9454984 hartree
pointgroup: C01 [X(C5H9N1O4)]
dipole: -0.3921658 -0.1963993 0.2267454 debye
dipolederiv: -0.8823353 0.1285708 0.5139584 0.1822136 -0.4599819 -0.2460627 0.4974673 -0.1949756 -0.6823073 -0.618007 -0.32549 0.282038 -0.3626236 -0.9565154 0.3688742 0.2543381 0.3161093 -0.421569 -0.6397252 0.1377198 -0.1086403 0.1063017 -0.3861786 0.1526111 0.1554091 0.0503247 -0.9485914 -0.4852712 -0.1175531 -0.1562454 -0.2152415 -0.5666692 0.0246156 0.0426955 0.2646053 -0.9181595 -0.5448229 -0.0395162 0.0299224 -0.0240645 -0.788591 0.2639594 0.0859379 0.330216 -0.3659039 0.5079214 -0.1098351 0.0130798 -0.0150239 0.5643195 -0.1270966 -0.0788796 -0.1645181 0.2287345 -0.2159894 0.1353445 -0.0111071 0.1959401 -0.0832887 0.0914716 -0.1351228 0.1385127 -0.1322099 -0.1360071 -0.1465633 -0.0625268 -0.072901 -0.1980647 0.0443038 -0.1738282 -0.0354991 -0.2092064 1.225571 -0.4615719 -0.2584564 -0.5114032 0.4391936 -0.0378924 -0.3964732 -0.0303059 1.3627238 0.6836253 0.5890186 0.0489981 0.702783 1.1108475 -0.2906226 -0.0414593 -0.3878991 1.1654861 0.0056928 -0.0521632 -0.0612817 -0.060667 -0.0193407 -0.0516899 -0.0543805 -0.0566243 -0.0543925 0.0347521 -0.050797 0.0390197 -0.0789195 0.0403589 0.0640345 0.0757652 0.039743 0.0938411 0.11951 0.0163263 -0.0695104 0.0092781 0.0575862 -0.0739978 -0.0137243 -0.0752278 0.0613522 -0.019055 0.0073506 0.1013703 -0.0068552 0.0654112 -0.0671765 0.0956978 -0.0349955 0.024561 0.1504178 0.0458526 -0.0757229 0.0470864 -0.0287702 0.0366008 -0.0382588 0.0496866 0.1067191 0.085193 0.178692 0.0431877 0.0652779 0.3098758 -0.0344445 0.0547173 -0.1174009 0.0880493 0.159583 0.0449258 -0.1028708 -0.0000787 0.2592946 -0.1494914 -0.0732462 -0.0972737 0.2306035 0.2570117 0.0914923 -0.0752676 0.0919264 0.322321 0.0686449 -0.1286086 0.0939932 0.2131317 0.311935 -0.0718032 -0.089945 -0.0530289 0.3181922 -0.0366414 -0.1280464 -0.0884707 0.1571377 unknown
polarizability: 76.3162495|-0.9028727|68.0202881|-1.3386885|-3.5970159|72.4180631 unknown
InChI: InChI=1S/C5H9NO4/c6-3(1-4(7)8)2-5(9)10/h3,7,9H,1-2,6H2
charge 0 multiplicity 1
19 atoms
O  2.992067 -0.438379 -1.118882
O  -2.331981 -1.918407 0.752114
O  2.2496 -0.360187 1.07485
O  -1.909072 -0.679641 -1.157591
N  -1.039302 2.126909 -0.361093
C  -0.140861 1.165339 0.305273
C  0.916372 0.707936 -0.727481
C  -0.859744 -0.031114 1.001736
C  2.069196 -0.067038 -0.13111
C  -1.718023 -0.860382 0.070068
H  0.393861 1.707911 1.10771
H  1.323727 1.608209 -1.223745
H  0.451599 0.105861 -1.530585
H  -1.516916 0.344375 1.810374
H  -0.122856 -0.692579 1.495721
H  -1.594557 2.702557 0.278568
H  -1.605502 1.698882 -1.102233
H  3.744832 -0.932527 -0.692871
H  -2.890638 -2.441025 0.113478
