program: Gaussian 09
title: 000061335
version: EM64L-G09RevD.01
frameworkgroup: C1[X(C20H27N)]
method: RPBEPBE
basis: SDD
operation: Freq
keyword: #pfreq=noraman
keyword: PBEPBE/SDD
title: #p freq=noraman PBEPBE/SDD
converged: YES YES NO NO
title: Mulliken charges:
elementType: N C C C C C C C C C C C C C C C C C C C C H H H H H H H H H H H H H H H H H H H H H H H H H H H
charge: -0.516568 -0.384830 -0.364342 -0.371470 -0.385914 -0.353199 -0.575994 -0.356401 0.520156 -0.696436 -0.430130 -0.400641 0.450458 -0.393625 -0.456055 0.458674 -0.447920 -0.386102 -0.197267 -0.218223 -0.267623 0.193513 0.193737 0.191276 0.191971 0.189451 0.189214 0.209496 0.207781 0.188060 0.187941 0.204141 0.204843 0.194799 0.194577 0.209848 0.214919 0.209714 0.230608 0.230591 0.262290 0.222170 0.293770 0.222472 0.264426 0.222761 0.222190 0.226888
chargesum: 0.00000
title: Mulliken charges with hydrogens summed into heavy atoms:
elementType: N C C C C C C C C C C C C C C C C C C C C
charge: -0.222798 0.002420 0.018905 0.007196 0.031363 0.022802 -0.167010 0.032976 0.520156 -0.061954 -0.199522 -0.170050 0.450458 -0.131335 -0.233885 0.458674 -0.225448 -0.121675 0.025494 0.003967 -0.040735
polarizability: 3.62467628e+02 -3.96232551e+01 2.03260053e+02 1.18334044e+01 2.33327845e+01 1.57531683e+02
1716.lowfreq: -0.8783 -0.0017 -0.0004 0.0012 1.4162 4.6373 11.3027 21.2234 37.2815
frequency: 10.9216 21.1689 37.2757 43.9227 47.5040 54.1128 72.7675 93.4485 95.7179 107.4806 143.0639 144.8613 153.6440 163.9247 210.0741 230.1169 250.7276 277.7390 299.0398 319.4731 363.1639 392.4618 405.4835 412.7940 435.2801 467.9544 480.3761 509.9711 525.1899 562.8515 612.2364 622.5113 646.0260 693.4305 718.2852 720.3875 727.2738 745.9949 752.0223 783.1638 787.6999 806.1603 820.4335 832.8850 845.1640 853.8433 871.2858 889.2861 892.6108 929.6717 941.9924 957.6080 967.5895 981.6717 983.3714 985.7274 1002.9357 1004.2745 1013.0841 1025.3025 1041.5552 1057.4965 1072.4230 1077.5881 1080.8524 1088.0902 1119.4952 1132.7143 1170.2109 1185.3132 1186.7060 1193.0297 1215.0029 1220.5947 1221.8642 1227.1218 1257.1831 1258.1000 1269.8914 1279.8632 1282.9781 1292.0261 1295.0234 1296.8497 1322.5389 1326.5781 1329.0536 1345.5908 1356.3401 1356.8725 1369.0913 1384.8809 1388.8030 1414.5866 1442.7681 1461.2347 1461.6202 1465.4866 1468.1317 1474.1936 1476.7854 1480.7636 1486.7848 1487.0939 1489.6142 1501.1220 1519.0394 1584.8762 1597.2379 1615.7204 1629.8727 2948.7082 2950.5372 2953.0617 2959.7567 2965.7284 2968.0617 2971.5105 2975.0896 2983.2460 2989.3654 3000.5971 3011.4048 3022.2366 3035.8377 3046.2484 3068.2229 3069.6961 3106.7448 3111.6760 3116.9858 3127.6426 3132.1664 3139.6673 3159.0783 3164.4606 3172.9358 3540.6515
redmass: 4.2584 4.0420 3.2656 4.1714 1.6877 3.5396 3.9252 1.8697 2.4581 3.2285 2.0137 1.9497 5.2026 3.6798 3.9535 1.1312 4.0676 4.0854 3.6357 3.3752 2.9084 3.5470 2.8952 3.0345 3.0839 2.3993 1.8691 2.4469 2.5615 4.3774 5.9655 5.2329 6.1533 2.0554 3.6874 1.0620 1.0786 1.1188 1.7699 3.0669 1.2826 2.6715 1.2913 1.7127 1.5800 1.2546 4.7849 1.8675 1.4602 1.2415 1.3856 1.3688 1.3671 2.6554 1.9822 3.2844 1.2214 2.7114 3.7890 2.1413 3.1645 2.9691 1.3213 2.3401 2.2194 1.5258 2.6084 1.2690 1.0505 1.7748 1.1068 1.1261 1.2698 1.5000 2.4015 2.8224 1.3076 1.3367 1.5168 1.0540 1.1542 1.0917 1.1856 1.2695 1.4725 1.4000 1.5865 1.4852 1.6398 1.6153 2.9211 7.0041 1.2180 3.6135 2.5455 1.0746 1.0747 1.0695 1.0817 1.0815 1.0426 1.0856 1.1089 2.1341 1.0959 2.1532 2.9970 6.4771 3.7780 6.2182 6.5024 1.0589 1.0590 1.0593 1.0592 1.0590 1.0586 1.0367 1.0591 1.0966 1.0987 1.1010 1.1021 1.1043 1.1048 1.1047 1.1005 1.0994 1.0868 1.0875 1.0895 1.0865 1.0964 1.0932 1.0949 1.0962 1.0974 1.0753
irintensity: 0.0275 0.2077 0.1453 0.7030 0.0217 0.0080 0.6382 0.0165 0.0106 0.0404 0.0061 0.0064 1.5453 0.9742 5.6901 0.0050 0.4611 1.6462 2.5870 2.0845 1.0524 5.8064 1.5927 0.7149 3.6440 39.0930 94.7217 34.6667 1.6984 3.8886 0.9323 5.1004 2.2555 37.4054 3.2157 13.7814 0.0018 2.7833 89.7917 3.0126 0.6958 26.8795 7.2642 9.9468 28.3139 1.6636 2.2006 4.9338 4.3002 0.4528 0.1190 0.5455 0.5279 2.0479 3.2923 0.3816 0.1492 0.6911 2.4487 8.1349 0.1859 0.2809 0.9401 0.3714 0.2055 9.1012 22.7745 13.9215 0.8181 0.7554 13.1643 4.3122 13.9455 0.3781 1.5432 4.9071 0.2612 0.3391 10.3003 0.3469 0.6100 0.0094 0.2714 0.7725 49.0141 3.8674 66.4597 0.6024 0.0225 1.2226 97.6385 14.3203 11.0115 1.0960 5.1794 0.0099 0.0532 0.0927 0.2707 1.7039 12.1832 0.4258 7.9210 94.7569 31.5957 8.9488 522.2330 6.6028 29.3300 289.7313 18.4754 3.6332 1.9249 0.1270 28.2606 2.9701 105.1773 36.7102 138.4953 0.3997 0.6757 0.8780 0.2077 0.5949 39.9373 155.4809 93.8963 59.6613 21.7495 13.6239 26.2232 2.9514 23.7476 31.2480 40.0626 4.4896 8.5292 16.0050
temp: 298.150 k
press: 1.00000 atm
elementType: 7 6 6 6 6 6 6 6 6 6 6 6 6 6 6 6 6 6 6 6 6 1 1 1 1 1 1 1 1 1 1 1 1 1 1 1 1 1 1 1 1 1 1 1 1 1 1 1
symmnumber: 1
zpe: 1095757.9 jmol-1
zpe.correction: 0.417352 hartree
zpe.thermalcorrener: 0.439181 hartree
zpe.thermalcorrenthalpy: 0.440125 hartree
zpe.thermalcorrgfe: 0.362451 hartree
zpe.sumelectzpe: -831.516993 hartree
zpe.sumelectthermal: -831.495164 hartree
zpe.sumelectthermalent: -831.494220 hartree
zpe.sumelectthermalfe: -831.571895 hartree
dipole: 0.3684 -0.7989 -0.5125
dipole: 1.0181
quadrupole: -122.1734 -124.2449 -128.4170
quadrupole: 2.3986 4.8788 8.4195
quadrupole: 2.7717 0.7002 -3.4719 2.3986 4.8788 8.4195
hfenergy: -831.9343451 hartree
pointgroup: C01 [X(C20H27N1)]
dipole: 0.147119 -0.3022624 -0.2178203 debye
polarizability: 363.2898256|-38.5186807|200.0199061|8.8723905|25.7526855|159.9496326 unknown
InChI: InChI=1S/C20H27N/c1-2-3-4-5-6-8-11-18-14-16-20(17-15-18)21-19-12-9-7-10-13-19/h7,9-10,12-17,21H,2-6,8,11H2,1H3
charge 0 multiplicity 1
48 atoms
N  -3.941816 -0.820138 -0.674514
C  4.981535 0.250482 -0.132656
C  4.04325 -0.797668 0.506919
C  6.465713 0.058893 0.253938
C  2.558092 -0.596017 0.133587
C  7.407341 1.101759 -0.389471
C  1.624201 -1.663862 0.769481
C  8.89075 0.911084 0.001719
C  0.159629 -1.456397 0.416492
C  9.825682 1.955131 -0.646459
C  -0.697141 -0.686767 1.243907
C  -0.395764 -1.994523 -0.773327
C  -2.586005 -0.976623 -0.296994
C  -2.046386 -0.450299 0.909242
C  -1.73674 -1.756601 -1.131963
C  -4.866016 0.184418 -0.311412
C  -6.255362 -0.087482 -0.479067
C  -4.474547 1.470757 0.158197
C  -7.221521 0.893801 -0.181839
C  -5.453206 2.440184 0.46298
C  -6.83107 2.16549 0.300981
H  4.881906 0.205966 -1.237394
H  4.653211 1.267746 0.167107
H  4.365155 -1.814701 0.197898
H  4.151305 -0.761339 1.611573
H  6.565067 0.108125 1.358725
H  6.79258 -0.960366 -0.041497
H  2.225303 0.412066 0.454337
H  2.442171 -0.624075 -0.968995
H  7.080873 2.121876 -0.096813
H  7.311972 1.05112 -1.494509
H  1.958724 -2.666481 0.43548
H  1.755791 -1.635846 1.869547
H  8.985262 0.963132 1.105808
H  9.215533 -0.108975 -0.28944
H  9.542827 2.98157 -0.345174
H  10.879406 1.794988 -0.352127
H  9.771652 1.904018 -1.750471
H  -0.306683 -0.277446 2.184387
H  0.233271 -2.605368 -1.433112
H  -2.687008 0.102819 1.601666
H  -2.134698 -2.172245 -2.066804
H  -4.30329 -1.537618 -1.305141
H  -6.571453 -1.07633 -0.835867
H  -3.414667 1.723614 0.247518
H  -8.283698 0.660949 -0.319191
H  -5.131113 3.426271 0.817512
H  -7.582618 2.925007 0.539739
