program: Gaussian 09
title: 000061336
version: EM64L-G09RevD.01
frameworkgroup: C1[X(C29H24N6)]
method: RPBEPBE
basis: SDD
operation: Freq
keyword: #pfreq=noraman
keyword: PBEPBE/SDD
title: #p freq=noraman PBEPBE/SDD
converged: YES YES NO NO
title: Mulliken charges:
elementType: N N N N N N C C C C C C C C C C C C C C C C C C C C C C C C C C C C C H H H H H H H H H H H H H H H H H H H H H H H H
charge: -0.432357 -0.439309 -0.086038 -0.117340 -0.097010 -0.126790 0.207365 0.014905 0.356910 0.348614 -0.661295 -0.726484 0.327872 -0.437474 -0.454402 -0.099524 -0.455349 -0.283432 -0.194747 -0.051969 0.260044 0.275628 -0.293377 -0.072275 -0.393270 -0.290002 -0.396441 -0.237975 -0.235476 0.182314 -0.295954 -0.345798 -0.201113 -0.204150 -0.240814 0.296510 0.289176 0.214440 0.251499 0.213113 0.255963 0.217909 0.214745 0.223032 0.222621 0.276072 0.267876 0.223994 0.264149 0.272294 0.272728 0.272193 0.224757 0.225350 0.266034 0.249707 0.225810 0.228324 0.228222
chargesum: 0.00000
title: Mulliken charges with hydrogens summed into heavy atoms:
elementType: N N N N N N C C C C C C C C C C C C C C C C C C C C C C C C C C C C C
charge: -0.135847 -0.150133 -0.086038 -0.117340 -0.097010 -0.126790 0.207365 0.014905 0.356910 0.348614 0.017757 -0.037868 0.327872 -0.214442 -0.231781 -0.099524 -0.179277 -0.015555 0.029247 -0.051969 0.260044 0.275628 -0.029229 -0.072275 -0.120976 -0.017275 -0.124248 -0.013219 -0.010126 0.182314 -0.029920 -0.096091 0.024696 0.024175 -0.012593
polarizability: 1.36383635e+03 -4.12726576e+01 4.40530184e+02 4.55089596e+00 3.81981635e+00 1.60887316e+02
1716.lowfreq: -6.7143 -0.1974 -0.0449 -0.0012 2.4603 3.0556 6.6979 13.1603 21.3970
frequency: 5.9310 13.0615 21.3879 23.7529 41.1138 59.0820 70.0558 87.6425 100.5867 107.6877 121.5559 141.6722 155.7940 161.6883 187.5326 209.6291 213.3223 226.2330 228.5459 244.6409 251.1448 252.0038 268.2862 274.3480 311.6326 333.3717 354.3777 363.7964 384.3971 406.5691 407.5053 418.6698 428.6181 432.0972 454.9260 459.8294 475.5748 476.9956 481.8591 486.1743 494.1815 503.1034 513.4820 527.7758 529.0604 559.4379 574.3422 600.6424 608.1621 619.3691 629.4094 645.0343 647.6670 664.1021 682.8533 689.8512 692.1358 748.3406 765.5644 769.1657 777.0736 778.5625 787.4513 792.3527 817.8527 823.3767 828.0267 842.1118 849.9012 855.4446 878.4616 888.3561 894.2655 904.2651 904.8929 930.1070 936.9345 950.7224 972.5999 975.1396 984.1285 984.3439 984.4929 987.6930 992.2804 997.7775 1001.1662 1006.4327 1007.6638 1013.5257 1032.3204 1042.4730 1053.8140 1075.1279 1095.2179 1136.8598 1138.4721 1150.6743 1154.4511 1168.6697 1172.1518 1172.9611 1176.8874 1183.8918 1189.4017 1196.4380 1205.1479 1217.5392 1225.6025 1253.4017 1270.0269 1275.7184 1293.5735 1298.1924 1304.2979 1327.0669 1358.3159 1368.7724 1374.0545 1381.3739 1387.2385 1388.6153 1393.7167 1417.2266 1419.1347 1434.6305 1435.4242 1438.3623 1442.4538 1446.9795 1455.3007 1458.6717 1462.3619 1464.0253 1466.9365 1480.2614 1494.8199 1513.6352 1536.3562 1545.0516 1561.8564 1572.7658 1578.9368 1600.0381 1606.3578 1620.8725 1622.5732 2979.8917 2990.5890 3076.4758 3086.2049 3093.4343 3107.5807 3121.7008 3122.1122 3125.8484 3126.4318 3137.0131 3145.5169 3146.2838 3151.9012 3152.7713 3164.0856 3165.0631 3171.7098 3171.9163 3172.2449 3177.3345 3183.5947 3552.2359 3559.9414
redmass: 4.6422 4.1475 5.0644 5.8032 5.2984 5.4079 4.6890 4.1232 5.0052 4.0991 5.9847 5.5858 4.6907 4.9618 5.6637 5.2440 1.0260 5.7718 3.3705 3.6822 3.6894 2.2199 3.2056 2.4075 2.7512 3.0310 2.7058 6.0728 3.3750 1.8009 2.7441 2.4255 3.1156 2.4457 4.0387 3.7371 3.6512 3.5104 4.3758 4.0789 7.4879 4.6314 3.3331 4.1551 6.3275 6.8074 5.2597 5.8195 6.5154 5.7664 3.0477 3.9254 5.3432 4.0447 4.0698 5.5827 1.8668 5.6266 3.3642 2.3046 4.4429 1.6966 1.4246 5.0103 2.9286 2.0864 2.0411 4.1654 1.2493 4.1597 1.7351 1.4766 4.4935 1.7376 1.6656 2.9839 1.4494 2.1286 1.3805 2.8059 3.9419 1.4487 1.4389 1.3690 1.3237 1.3242 1.7511 1.3544 2.3369 2.0916 2.0203 5.2975 2.6811 1.4826 1.6875 1.7039 1.9957 1.4765 1.3937 1.0614 1.2538 1.6118 1.3685 2.2857 1.9947 2.1531 2.1128 3.0613 2.8285 3.6111 1.8733 2.3362 3.2301 1.8772 1.7516 6.1624 4.3157 4.8817 1.2091 2.4521 2.6987 7.2584 1.2355 9.2789 7.2499 2.1828 2.7749 2.5088 2.4016 2.9119 1.1384 1.3445 1.7987 2.2551 1.3377 1.1099 1.5516 4.4812 5.1733 6.1934 4.4565 7.2825 6.1518 6.2471 7.4654 6.6934 6.7067 1.0352 1.0364 1.1001 1.0990 1.1007 1.1008 1.0894 1.0874 1.0850 1.0862 1.0889 1.0939 1.0918 1.0931 1.0870 1.0934 1.0962 1.0974 1.0960 1.0944 1.0971 1.0948 1.0772 1.0771
irintensity: 0.2797 0.6187 0.5730 0.7912 0.0191 0.3196 0.9574 0.5602 1.5425 0.5368 2.0985 2.0472 18.6477 1.3908 2.0176 4.4204 0.1236 4.8059 9.3829 17.3705 4.4468 1.8214 0.2808 1.7059 1.7305 4.9593 3.4787 31.8449 16.2307 83.1330 8.9378 13.2922 2.9533 87.6169 9.9187 3.5266 0.9464 12.3148 8.4684 2.0007 16.2577 63.1687 14.9058 13.9578 11.9626 27.3198 5.6538 32.8850 2.6965 3.8046 1.8061 33.7095 12.2846 0.8586 4.7498 6.9745 43.6913 2.8548 15.0123 41.1366 1.4354 106.2501 39.7904 3.9848 87.7682 14.5352 5.9176 1.2316 0.0247 2.1210 26.5893 1.3586 5.6472 2.0240 8.5351 11.1872 7.9219 1.9994 2.0878 0.3097 1.0182 2.2146 0.5324 3.0229 9.7655 1.0946 27.9520 0.7958 33.2708 9.6819 21.9448 5.2116 9.4562 12.8632 70.3923 3.5415 159.0556 178.1671 118.9294 5.4489 79.8165 388.7304 76.9415 257.5028 26.9026 34.3566 81.0619 31.9142 460.7705 18.7686 9.6254 297.9810 504.1064 22.2387 55.9205 16.8394 7.5781 21.9578 26.9091 3.7296 9.9501 5.8825 80.0714 85.3862 245.2531 28.0783 5.5353 47.7103 13.9810 3.5395 0.6960 15.3379 16.1183 11.9610 132.7225 10.4486 164.7567 24.5038 113.0345 0.4918 19.3882 96.4494 1.9302 7.6681 1475.9395 226.6578 16.5966 22.4345 48.4527 3.7389 40.8397 37.1656 30.3772 33.4221 21.2943 7.5131 9.8459 11.6308 35.9245 25.2876 37.5421 0.3397 8.6951 29.1690 31.8959 11.7333 25.0766 34.4220 7.4549 128.6977 42.5927
temp: 298.150 k
press: 1.00000 atm
elementType: 7 7 7 7 7 7 6 6 6 6 6 6 6 6 6 6 6 6 6 6 6 6 6 6 6 6 6 6 6 6 6 6 6 6 6 1 1 1 1 1 1 1 1 1 1 1 1 1 1 1 1 1 1 1 1 1 1 1 1
symmnumber: 1
zpe: 1210462.7 jmol-1
zpe.correction: 0.461041 hartree
zpe.thermalcorrener: 0.489962 hartree
zpe.thermalcorrenthalpy: 0.490906 hartree
zpe.thermalcorrgfe: 0.398395 hartree
zpe.sumelectzpe: -1445.567960 hartree
zpe.sumelectthermal: -1445.539040 hartree
zpe.sumelectthermalent: -1445.538096 hartree
zpe.sumelectthermalfe: -1445.630607 hartree
dipole: -10.1029 -0.0228 1.1789
dipole: 10.1715
quadrupole: -100.3086 -178.0969 -213.0537
quadrupole: -2.1678 -8.5594 1.8200
quadrupole: 63.5111 -14.2772 -49.2339 -2.1678 -8.5594 1.8200
hfenergy: -1446.0290014 hartree
pointgroup: C01 [X(C29H24N6)]
dipole: 3.9827174 0.104801 0.3756489 debye
polarizability: 1363.8290434|-38.0047766|431.190314|-21.4816425|-48.6438887|170.2344941 unknown
InChI: InChI=1S/C29H24N6/c1-29(2)30-26-14-8-13-22-25(17-18-27(31-29)28(22)26)35-34-24-16-15-23(20-11-6-7-12-21(20)24)33-32-19-9-4-3-5-10-19/h3-18,30-31H,1-2H3
charge 0 multiplicity 1
59 atoms
N  6.934247 -0.884994 0.166473
N  7.32843 1.245688 -0.813159
N  1.3484 -0.106074 -0.237976
N  0.55403 -1.129763 0.042704
N  -5.060746 -0.161801 0.096605
N  -5.467232 1.09009 0.061274
C  7.855909 0.279587 0.174704
C  5.038262 0.511477 -0.433119
C  5.558608 -0.732084 0.071918
C  5.956627 1.521365 -0.894585
C  7.898484 0.908395 1.600427
C  9.257039 -0.185107 -0.268252
C  3.617302 0.70918 -0.558854
C  4.666674 -1.776665 0.430858
C  5.457411 2.710094 -1.460168
C  2.725418 -0.364531 -0.14501
C  3.14128 1.932164 -1.121928
C  3.279953 -1.586529 0.324682
C  4.052675 2.90156 -1.564695
C  -0.82662 -0.820602 0.030746
C  -1.740216 -1.941875 0.154953
C  -3.167187 -1.695878 0.175015
C  -1.344819 0.497499 -0.062694
C  -3.652495 -0.332685 0.075864
C  -1.264535 -3.289816 0.253889
C  -2.727784 0.735676 -0.040691
C  -4.061593 -2.809513 0.290534
C  -2.160006 -4.355783 0.366042
C  -3.568907 -4.11317 0.383814
C  -6.886788 1.253714 0.060197
C  -7.839422 0.192464 0.069577
C  -7.336224 2.602589 0.045926
C  -9.214386 0.490714 0.065811
C  -8.716179 2.892496 0.042749
C  -9.660122 1.838106 0.052734
H  7.308797 -1.771785 0.506255
H  7.98326 1.951526 -1.150993
H  8.576265 1.781412 1.618188
H  6.889722 1.243699 1.897537
H  8.257007 0.173714 2.344615
H  9.209427 -0.635374 -1.27359
H  9.957603 0.668998 -0.290349
H  9.66543 -0.925893 0.44282
H  5.067164 -2.724808 0.809567
H  6.148365 3.482601 -1.817861
H  2.062883 2.078067 -1.212819
H  2.58463 -2.377841 0.62105
H  3.678939 3.834023 -2.002696
H  -0.631237 1.322287 -0.146166
H  -0.183696 -3.451411 0.237155
H  -3.127954 1.751593 -0.111998
H  -5.134954 -2.604287 0.302197
H  -1.784678 -5.382573 0.441575
H  -4.263764 -4.956126 0.471058
H  -7.475998 -0.83948 0.078557
H  -6.582274 3.396822 0.038109
H  -9.948305 -0.323425 0.072393
H  -9.056246 3.933855 0.032166
H  -10.733174 2.060414 0.049566
