program: Gaussian 09
title: 000073055
version: EM64L-G09RevD.01
frameworkgroup: C1[X(C7H8O4)]
method: RPBEPBE
basis: SDD
operation: Freq
keyword: #p
keyword: freq=noraman
keyword: PBEPBE/SDD
title: #p freq=noraman PBEPBE/SDD
converged: NO YES NO NO
title: Mulliken charges:
elementType: O O O O C C C C C C C H H H H H H H H
charge: -0.272711 -0.421841 -0.238957 -0.445583 -0.141128 -0.210194 -0.123829 0.176172 -0.360905 0.276789 -0.451995 0.273453 0.270222 0.256366 0.254270 0.217830 0.220544 0.350063 0.371433
chargesum: 0.00000
title: Mulliken charges with hydrogens summed into heavy atoms:
elementType: O O O O C C C C C C C
charge: -0.272711 -0.071778 -0.238957 -0.074150 0.132325 0.060028 0.132537 0.176172 -0.106635 0.276789 -0.013621
polarizability: 1.07008958e+02 -1.28526641e+01 8.59384973e+01 3.68893602e+00 -6.17065641e+00 6.31367692e+01
1716.lowfreq: -12.1364 -6.6643 -0.0005 -0.0005 0.0008 13.5640 65.5228 79.4305 146.4563
frequency: 65.5024 79.3929 146.4532 186.0043 219.9475 243.5208 304.0467 353.6873 362.7813 421.5759 447.9454 477.3532 507.8997 553.3834 574.1031 678.9124 717.7150 768.7341 797.4250 823.6827 858.6157 895.7743 947.5261 958.4428 984.2335 1007.5107 1054.8229 1094.4527 1128.5015 1180.1258 1185.4270 1208.1132 1244.0970 1314.4729 1321.4194 1341.0145 1348.6683 1365.6725 1376.9486 1394.3073 1460.4083 1564.1273 1638.5394 2962.1045 3044.0749 3081.8246 3116.4642 3122.6730 3145.2765 3474.4192 3538.6951
redmass: 6.4613 7.0420 3.7797 4.6241 5.7641 5.6590 2.8445 1.3607 3.7089 5.2195 5.5967 5.6553 7.1463 3.7753 1.0946 4.9732 6.6651 5.9663 3.5768 5.4227 2.9321 1.8314 3.7574 3.5931 2.3780 1.5331 1.3608 1.8872 2.3833 1.1516 1.2086 1.2636 1.5544 1.5003 1.3227 1.9413 1.2167 2.7051 2.3060 1.3648 1.0954 8.8773 7.9037 1.0676 1.0838 1.0956 1.0888 1.0918 1.0934 1.0653 1.0667
irintensity: 3.9835 6.2766 9.4690 1.1935 0.6039 2.8333 0.1261 79.5679 76.1918 2.5158 5.7270 7.5736 11.9661 2.5912 251.6336 7.7337 35.5547 6.5974 4.6428 34.5021 14.8977 12.4607 98.6342 43.8470 9.6974 22.7530 4.0240 32.2758 1.9199 46.9546 30.9781 14.9697 7.4366 0.9040 38.3990 1.2841 35.2067 19.9011 44.9617 42.2539 7.6351 155.0810 24.0019 49.1129 8.3357 16.6051 8.3669 8.2022 10.0105 30.0228 13.8049
temp: 298.150 k
press: 1.00000 atm
elementType: 8 8 8 8 6 6 6 6 6 6 6 1 1 1 1 1 1 1 1
symmnumber: 1
zpe: 371373.6 jmol-1
zpe.correction: 0.141449 hartree
zpe.thermalcorrener: 0.151581 hartree
zpe.thermalcorrenthalpy: 0.152525 hartree
zpe.thermalcorrgfe: 0.105799 hartree
zpe.sumelectzpe: -571.522053 hartree
zpe.sumelectthermal: -571.511921 hartree
zpe.sumelectthermalent: -571.510977 hartree
zpe.sumelectthermalfe: -571.557702 hartree
dipole: 2.0566 -0.7447 0.0460
dipole: 2.1878
quadrupole: -73.8448 -68.4139 -61.7660
quadrupole: 1.0247 -5.8033 -5.8981
quadrupole: -5.8366 -0.4057 6.2423 1.0247 -5.8033 -5.8981
hfenergy: -571.6635018 hartree
pointgroup: C01 [X(C7H8O4)]
dipole: -0.8249106 0.2446311 0.0236416 debye
dipolederiv: -0.2907407 -0.0865149 -0.0183412 -0.1693031 -0.4828189 0.1100261 0.0695349 0.1466498 -0.4764787 -0.4694158 0.0181559 -0.1921481 -0.032224 -0.6420958 0.1154544 -0.3707947 0.1754018 -0.4851065 -0.9318343 0.196078 0.1500414 0.1531843 -0.66207 -0.1397669 0.1916005 -0.1583175 -0.3875106 -0.8703673 -0.0050508 0.0236637 -0.0918014 -0.2403981 -0.0197982 0.0570845 0.0346801 -0.6133277 0.2733457 0.0312485 0.0276928 0.0203719 0.2157997 0.0101651 -0.0651822 -0.0832645 0.1985548 -0.2454695 -0.0183714 0.0819267 0.0274503 0.2113596 0.0202055 0.021307 0.054182 0.2377054 0.3193188 -0.0286268 -0.0191009 0.0633381 0.3655946 -0.1421384 0.0807162 -0.2183209 0.4283066 0.9876028 -0.0550656 -0.1760238 -0.2075408 0.91507 0.2613857 -0.2689335 0.3346279 0.2373216 0.0238824 -0.2112369 -0.0345648 -0.1006742 0.1130456 0.1551945 0.0549214 0.1649914 -0.1087735 -0.0164032 0.1188268 0.0604681 0.1872363 -0.4869349 -0.1523036 0.0300821 -0.1778812 -0.1709438 0.4750983 0.0265533 -0.0655778 0.026933 0.2419771 0.0051355 0.0113592 -0.0767139 0.501577 -0.04503 -0.0417874 -0.0777291 -0.0100713 0.0438413 -0.0086064 -0.0474217 -0.0018808 0.0596271 0.0449632 -0.0113818 0.0261897 -0.0404347 -0.004362 -0.0835847 0.0090947 -0.0752192 0.0318273 -0.013154 0.0311593 0.0728604 0.0445293 0.0352903 -0.0203045 0.0270788 0.008931 -0.0100173 0.0539342 -0.0458934 -0.0229696 -0.0489006 -0.0273541 -0.0801202 0.0050936 -0.084222 0.0884802 -0.0363442 0.0192247 -0.044622 0.0500662 -0.004808 0.1498444 -0.0078988 0.0794352 -0.089366 0.0528441 0.0335572 0.0452563 -0.0243404 -0.0781155 -0.1045261 0.010643 -0.0552474 0.0352642 0.1336397 0.0430217 0.1481017 0.054725 0.3294822 -0.0423165 0.1901773 -0.0486234 0.2257827 0.5541298 -0.0138963 0.0148767 0.097456 0.1574969 -0.0339457 0.0015376 -0.0192081 0.297077 unknown
polarizability: 108.5082116|-11.3811695|83.7566937|-4.2263305|7.0512221|63.8193191 unknown
InChI: InChI=1S/C7H8O4/c8-2-3-1-4(9)6-7(11-6)5(3)10/h1,4,6-9H,2H2
charge 0 multiplicity 1
19 atoms
O  -1.454585 -1.536769 0.839775
O  -2.135292 1.817519 -0.887101
O  1.745928 -1.414149 -0.733395
O  3.109811 1.049917 -0.434479
C  -1.852101 -0.53366 -0.202524
C  -0.6437 -1.402003 -0.444704
C  -1.676889 0.923066 0.20607
C  0.723697 -0.804673 -0.280103
C  -0.269549 1.289669 0.620643
C  0.839856 0.517683 0.397941
C  2.249082 0.971273 0.752842
H  -2.785481 -0.760397 -0.733192
H  -0.700397 -2.272347 -1.107519
H  -2.384061 1.149053 1.023942
H  -0.160355 2.279503 1.083679
H  2.682393 0.280706 1.507479
H  2.230557 1.989001 1.175609
H  -1.443326 1.830951 -1.599013
H  3.176911 0.124157 -0.798351
