program: Gaussian 09
title: 000002122
version: EM64L-G09RevD.01
frameworkgroup: C1[X(C11H14ClN3O4S3)]
method: RPBEPBE
basis: SDD
operation: Freq
keyword: #p
keyword: freq=noraman
keyword: PBEPBE/SDD
title: #p freq=noraman PBEPBE/SDD
converged: YES YES NO NO
title: Mulliken charges:
elementType: Cl S S S O O O O N N N C C C C C C C C C C C H H H H H H H H H H H H H H
charge: 0.009965 0.958293 0.950647 0.236842 -0.501155 -0.494362 -0.534568 -0.506039 -0.432242 -0.440005 -0.711100 -0.081217 -0.314934 0.630487 -0.753462 -0.238510 -0.375229 -0.018959 -0.074320 -0.756894 0.025893 -0.572682 0.329587 0.300439 0.311510 0.262341 0.274201 0.335942 0.265237 0.275823 0.259772 0.346164 0.337079 0.245470 0.230236 0.219750
chargesum: 0.00000
title: Mulliken charges with hydrogens summed into heavy atoms:
elementType: Cl S S S O O O O N N N C C C C C C C C C C C
charge: 0.009965 0.958293 0.950647 0.236842 -0.501155 -0.494362 -0.534568 -0.506039 -0.131803 -0.128494 -0.027858 0.248370 -0.314934 0.630487 -0.216920 0.097432 -0.109993 -0.018959 -0.074320 -0.221299 0.271363 -0.122696
polarizability: 3.42630725e+02 -5.87614885e+00 2.43688808e+02 5.56844287e+00 3.94697093e+00 1.54221834e+02
1716.lowfreq: -9.5316 -4.1113 -0.0019 -0.0015 0.0009 4.9922 5.9819 21.4683 28.4234
frequency: -5.8363 21.4400 28.4196 46.8595 55.8163 76.6820 91.9529 94.7965 105.8088 106.7265 127.7165 149.5009 151.5334 161.2980 166.4725 199.2811 203.4858 221.5497 240.8591 248.7792 271.3882 277.5940 294.9854 297.8677 315.9142 328.1256 342.4309 390.8023 392.3544 400.7031 422.6215 426.5789 444.0884 465.2750 472.2402 478.4428 488.8017 510.8433 557.5659 602.4096 644.4509 652.6169 694.7046 705.0279 733.2657 741.9073 766.8986 790.7802 806.9124 834.1319 847.4578 870.4562 874.0658 884.9434 915.7886 930.0804 940.5512 946.5361 957.7220 990.2295 1003.8939 1007.7838 1029.3443 1073.9884 1079.6068 1097.3146 1104.2058 1172.9581 1200.5692 1227.5384 1228.6185 1253.1186 1257.4738 1281.0804 1288.3689 1295.5076 1331.1153 1376.4586 1414.3767 1416.0181 1436.5050 1447.5736 1448.8761 1480.4916 1529.5172 1552.4082 1602.9491 1640.4919 2992.5727 3009.6628 3025.4441 3075.4683 3086.1832 3096.7836 3119.8665 3125.3406 3152.2828 3198.8152 3373.8123 3381.0982 3543.9041 3546.6417
redmass: 5.2395 7.6418 6.3231 7.8539 5.6545 6.0525 3.5954 4.8270 5.7308 6.5941 1.7027 4.9360 13.3658 5.9092 5.3168 7.0303 9.4879 3.4425 5.5847 7.4430 4.0904 4.3550 3.0586 5.0280 8.6009 6.7125 6.3857 2.4387 3.5327 8.0830 6.0967 6.2749 2.1849 2.3126 3.0692 3.1614 5.0299 4.8064 2.4345 7.0972 9.9480 5.3344 3.6823 2.2205 2.3507 5.5959 2.6444 1.7339 12.8293 5.8299 1.8563 2.3195 3.9719 1.4977 3.9560 1.4272 2.1812 1.3345 7.6754 6.7817 1.1518 3.9210 2.4485 1.5485 1.4122 2.2690 2.8287 1.2355 1.4813 1.1971 1.2008 1.3663 1.2725 1.7614 1.2625 2.4337 1.4734 1.2925 1.1527 6.5677 1.1077 1.1511 2.2994 2.9359 1.0856 5.2520 8.0929 4.4267 1.0582 1.0844 1.0580 1.1051 1.0610 1.1036 1.0969 1.0919 1.0923 1.1142 1.0412 1.0756 1.1009 1.0772
irintensity: 0.4889 0.0450 0.1969 1.3884 1.2252 4.0342 0.8062 2.7279 2.3718 0.6101 19.4949 1.9987 0.8064 6.0635 1.7693 2.3004 2.4667 1.2903 4.2696 1.9068 2.7662 3.2353 6.4094 6.9653 12.8135 3.8706 3.9967 4.5970 27.2964 84.6667 86.0948 40.1948 13.3275 128.2739 75.1084 30.3918 70.0867 47.2133 9.9476 43.6151 6.2105 13.7744 12.9598 28.8552 5.6973 17.6110 34.6967 154.8931 53.7741 126.8299 18.6290 42.3276 57.4737 16.6862 60.2739 7.4347 4.9611 100.2114 47.4632 138.9925 17.3351 15.1556 34.9732 12.4211 3.7196 34.7981 2.2375 5.9134 2.1846 32.8035 9.7719 47.6599 9.9987 13.7519 1.3042 16.4461 38.0052 34.8615 6.7176 1.4217 16.9408 9.8552 14.8641 235.2948 34.2247 64.1215 331.7332 9.4762 24.7967 10.4511 19.6751 4.4620 5.1609 4.7830 7.5579 24.4467 1.8106 19.2552 37.6073 16.6080 28.2214 48.0919
temp: 298.150 k
press: 1.00000 atm
elementType: 17 16 16 16 8 8 8 8 7 7 7 6 6 6 6 6 6 6 6 6 6 6 1 1 1 1 1 1 1 1 1 1 1 1 1 1
symmnumber: 1
zpe: 647266.8 jmol-1
zpe.correction: 0.246531 hartree
zpe.thermalcorrener: 0.270521 hartree
zpe.thermalcorrenthalpy: 0.271465 hartree
zpe.thermalcorrgfe: 0.191917 hartree
zpe.sumelectzpe: -2544.900827 hartree
zpe.sumelectthermal: -2544.876837 hartree
zpe.sumelectthermalent: -2544.875893 hartree
zpe.sumelectthermalfe: -2544.955440 hartree
dipole: 4.5224 8.6222 -4.9640
dipole: 10.9287
quadrupole: -149.4901 -174.2491 -164.6300
quadrupole: 11.8941 16.3320 0.8496
quadrupole: 13.2996 -11.4594 -1.8403 11.8941 16.3320 0.8496
hfenergy: -2545.1473574 hartree
pointgroup: C01[X(C11H14Cl1N3O4S3)]
dipole: -1.9854604 -3.0542635 -2.2839866 debye
polarizability: 341.4002182|-12.6747976|244.9840346|-3.5509912|4.7133443|154.1571138 unknown
InChI: InChI=1S/C11H14ClN3O4S3/c1-2-3-20-6-11-14-8-4-7(12)9(21(13,16)17)5-10(8)22(18,19)15-11/h2,4-5,11,14-15H,1,3,6,13H2
charge 0 multiplicity 1
36 atoms
Cl 3.328526 -3.052315 -0.564789
S  -0.455539 2.12211 0.350649
S  4.691627 -0.047057 0.30317
S  -5.018234 1.120736 -0.717518
O  0.249256 3.429321 -0.288877
O  -1.06137 2.109931 1.85154
O  4.823042 1.552327 0.577572
O  5.305725 -1.148875 1.322305
N  -1.881647 1.59071 -0.74891
N  -1.335399 -0.796463 -0.468751
N  5.375631 -0.335375 -1.37231
C  -2.364248 0.278235 -0.292755
C  0.636156 0.614739 0.079556
C  0.02605 -0.63278 -0.267173
C  -3.634054 -0.109458 -1.070337
C  2.019804 0.771701 0.224191
C  0.908344 -1.743046 -0.453166
C  2.847685 -0.345253 0.042641
C  2.290049 -1.596104 -0.291211
C  -6.442632 -0.119835 -0.350781
C  -6.134408 -0.971059 0.845691
C  -5.935512 -2.316151 0.795911
H  -2.614497 0.394215 0.780136
H  -1.552596 1.622049 -1.73197
H  -1.675201 -1.740313 -0.660798
H  -3.984609 -1.099464 -0.721452
H  -3.43778 -0.14351 -2.155878
H  2.470982 1.743009 0.465712
H  0.499677 -2.719492 -0.732658
H  -7.298923 0.554039 -0.17496
H  -6.63342 -0.715911 -1.258026
H  5.896364 0.512067 -1.652794
H  5.947048 -1.195179 -1.35774
H  -6.042818 -0.440271 1.803588
H  -5.706791 -2.894209 1.697913
H  -6.034887 -2.878868 -0.141523
