program: Orca
programVersion: 6.0.0
elementType: C C C C C O O H H H H H H H H H H
charge: 0
multiplicity: 1
keywords: DLPNO-CCSD(T) verytightscf rijcosx ano-pvqz autoaux tightpno
formula: C5H10O2
InChI: InChI=1/C5H10O2/c1-3-4(2)5(6)7/h4,6H,3H2,1-2H3
17 atoms
C  -1.865121 -1.019576 0.017329
C  -1.128653 0.308235 0.146006
C  0.307016 0.254676 -0.368286
C  0.972368 1.636301 -0.34733
C  1.148754 -0.679664 0.471127
O  2.123357 -1.276629 -0.251573
O  1.026124 -0.866482 1.652675
H  -2.893239 -0.932086 0.366646
H  -1.894158 -1.353779 -1.021163
H  -1.381625 -1.795949 0.609945
H  -1.112958 0.626987 1.189126
H  -1.656491 1.081646 -0.415797
H  0.319778 -0.125742 -1.391201
H  0.990452 2.033097 0.667693
H  0.409764 2.327341 -0.973615
H  1.99468 1.593186 -0.720148
H  2.640052 -1.811263 0.368666
totalener: -345.07423845339389 hartree
nucrepener: 321.98034352857485 hartree
electener: -667.05451037080138 hartree
oneelecener: -1108.58127726793145 hartree
twoeener: 441.52676689713007 hartree
kineticenergy: 344.81256724369848 hartree
energy: -560.7746 -559.0075 -309.6312 -306.0269 -305.5262 -305.4167 -305.0973 -39.8509 -37.0097 -30.0506 -27.2567 -24.6597 -23.3194 -20.9692 -19.2804 -18.8942 -17.4779 -16.7787 -16.2189 -15.8971 -15.7206 -14.6947 -14.2853 -13.4350 -13.2296 -13.0916 -12.7939 -12.0666 4.5425 4.6310 5.3226 5.5156 6.1260 6.4649 6.9135 7.1007 7.3515 7.6045 7.8071 electronvolt
chargesum: -0.0000000
charge: -0.372066 -0.087190 0.231441 -0.360123 0.536468 -0.458199 -0.637311 0.099201 0.094464 0.114603 0.087399 0.082922 0.086940 0.106776 0.109826 0.108408 0.256441
charge: 0.952310 0.379396 -0.174371 0.978456 -1.777184 1.698411 1.061828 -0.265963 -0.259651 -0.261624 -0.217813 -0.219171 -0.212407 -0.241355 -0.250226 -0.249378 -0.941259
qa: -0.3721 -0.0872 0.2314 -0.3601 0.5365 -0.4582 -0.6373 0.0992 0.0945 0.1146 0.0874 0.0829 0.0869 0.1068 0.1098 0.1084 0.2564
va: 3.6283 3.2819 2.8549 3.6050 3.7457 1.9932 1.8756 0.9657 0.9613 0.9570 0.9773 0.9634 0.9750 0.9682 0.9567 0.9661 1.0215
e0: -345.074238454 hartree
corrType: DLPNO BASED
energy: -346.588615827592 hartree
dipole: -6.154597779 6.179300212 0.024702433 3.963658875 -3.745257592 0.218401283 -3.070722234 2.394720517 -0.676001717
dipolemethod: SCF
magnitude: 0.710835882 au
magnitude: 1.806801224 debye
