program: Orca
programVersion: 6.0.0
elementType: O C O C C C C O H H H
charge: -1
multiplicity: 1
keywords: DLPNO-CCSD(T) verytightscf rijcosx ano-pvqz autoaux tightpno
formula: C5H3O3
InChI: InChI=1/C5H3O3/c6-5(7)4-2-1-3-8-4/h1-3H
11 atoms
O  2.060546 -0.723097 -1.583084
C  1.762189 -0.224498 -0.484416
O  2.483303 0.19455 0.444304
C  0.265401 -0.086879 -0.189934
C  -0.392351 0.405199 0.891884
C  -1.791549 0.285983 0.620129
C  -1.877977 -0.271734 -0.611253
O  -0.647081 -0.504645 -1.117579
H  0.093716 0.799826 1.765797
H  -2.619636 0.572683 1.247712
H  -2.709724 -0.55177 -1.234457
totalener: -415.87071781306986 hartree
nucrepener: 338.99063558834206 hartree
electener: -754.86130872571334 hartree
oneelecener: -1252.40507904589276 hartree
twoeener: 497.54377032017942 hartree
kineticenergy: 415.51477003884901 hartree
energy: -557.1747 -552.4232 -552.3799 -303.5191 -303.5067 -302.8963 -302.0643 -301.4817 -35.8301 -32.2396 -29.5643 -25.7310 -23.5746 -18.2377 -17.9854 -16.6024 -14.2352 -13.4881 -12.4816 -12.1165 -11.5387 -11.2622 -10.7060 -10.1573 -7.1393 -6.1830 -6.1050 -5.6058 -4.7534 7.4032 8.5415 9.1870 9.2201 9.6650 10.5651 10.9390 11.0873 11.8367 12.6956 12.9682 electronvolt
chargesum: -1.0000000
charge: -0.827850 0.616019 -0.852107 0.294784 -0.084331 -0.067759 0.011526 -0.381287 0.105073 0.083731 0.102203
charge: 0.847325 -2.306079 0.838668 -0.869439 0.206989 0.182905 -0.263694 1.201568 -0.260346 -0.276426 -0.301469
qa: -0.8279 0.6160 -0.8521 0.2948 -0.0843 -0.0678 0.0115 -0.3813 0.1051 0.0837 0.1022
va: 1.5808 3.9416 1.5430 3.0380 3.2493 3.2278 3.4879 2.0536 0.9423 0.9461 0.9287
e0: -415.870717813 hartree
corrType: DLPNO BASED
energy: -417.535670983305 hartree
dipole: -5.694243746 2.312125938 -3.382117807 1.125468365 -0.801708777 0.323759588 2.448681619 -1.753989861 0.694691758
dipolemethod: SCF
magnitude: 3.467872226 au
magnitude: 8.814630687 debye
