program: Orca
programVersion: 6.0.1
elementType: C C C C C C C O O C H H H H H H H
charge: -1
multiplicity: 1
keywords: DLPNO-CCSD(T) verytightscf rijcosx ano-pvqz autoaux tightpno
formula: C8H7O2
InChI: InChI=1/C8H7O2/c1-6-3-2-4-7(5-6)8(9)10/h2-5H,1H3
17 atoms
C  -2.639005 -0.818026 -0.051667
C  -1.32317 -0.102094 0.123398
C  -1.280113 1.228489 0.522434
C  -0.057883 1.874118 0.678885
C  1.12573 1.195138 0.437937
C  1.10417 -0.137761 0.037584
C  2.423561 -0.905291 -0.234149
O  3.468146 -0.242695 -0.067429
O  2.28558 -2.094666 -0.58742
C  -0.122714 -0.767397 -0.113876
H  -2.75912 -1.177435 -1.07531
H  -3.480138 -0.161926 0.175167
H  -2.704587 -1.688249 0.603931
H  -2.205143 1.762646 0.711835
H  -0.036748 2.912206 0.990641
H  2.091555 1.668175 0.550376
H  -0.108763 -1.804541 -0.426276
totalener: -456.99162041112550 hartree
nucrepener: 474.67895666449630 hartree
electener: -931.67069018508801 hartree
oneelecener: -1576.29773382883764 hartree
twoeener: 644.62704364374963 hartree
kineticenergy: 456.66543981734435 hartree
energy: -552.3678 -552.3650 -303.3579 -302.5219 -302.3729 -302.1910 -302.1384 -301.6979 -301.6631 -301.5448 -32.2142 -29.4798 -27.8676 -25.0483 -23.9710 -22.1374 -19.0822 -18.3135 -15.6527 -14.7201 -13.8800 -12.8938 -12.7818 -12.3829 -11.9611 -11.7131 -11.0306 -10.5834 -10.1541 -9.4959 -9.4525 -6.1153 -5.9378 -5.6980 -5.3831 -5.2564 6.7561 7.0761 8.0364 8.3696 9.4001 9.5307 9.6533 9.9415 10.3451 10.8126 11.0460 electronvolt
chargesum: -1.0000000
charge: -0.447077 0.289405 -0.154469 -0.118119 -0.092665 0.244656 0.584946 -0.858707 -0.860828 -0.095741 0.085545 0.073339 0.087074 0.042968 0.049320 0.088367 0.081984
charge: 0.951956 -0.327057 0.260028 0.256465 0.258665 -0.314095 -2.252712 0.844430 0.844315 0.297238 -0.263644 -0.274311 -0.263653 -0.254175 -0.261192 -0.259455 -0.242804
qa: -0.4471 0.2894 -0.1545 -0.1181 -0.0927 0.2447 0.5849 -0.8587 -0.8608 -0.0957 0.0855 0.0733 0.0871 0.0430 0.0493 0.0884 0.0820
va: 3.6542 2.7269 3.2469 3.2586 3.2916 2.6849 3.9274 1.5409 1.5377 3.2328 0.9690 0.9685 0.9679 0.9716 0.9704 0.9650 0.9647
e0: -456.991620411 hartree
corrType: DLPNO BASED
energy: -458.958445461184 hartree
dipole: -12.138460519 8.326981392 -3.811479127 2.215134550 -0.622266051 1.592868499 1.041039826 -0.444468430 0.596571397
dipolemethod: SCF
magnitude: 4.173787324 au
magnitude: 10.608924272 debye
