program: Orca
programVersion: 6.0.1
elementType: O C C C C C C C C O H H H H H H H
charge: -1
multiplicity: 1
keywords: DLPNO-CCSD(T) verytightscf rijcosx ano-pvqz autoaux tightpno
formula: C8H7O2
InChI: InChI=1/C8H7O2/c1-6-4-2-3-5-7(6)8(9)10/h2-5H,1H3
17 atoms
O  -0.768988 2.831885 -0.507492
C  -1.132568 1.753804 0.004657
C  -0.066867 0.628749 -0.008133
C  -0.379929 -0.737975 0.010478
C  -1.79701 -1.249085 0.019786
C  0.66251 -1.664979 0.005596
C  1.992831 -1.273077 0.004941
C  2.300256 0.079157 -0.011402
C  1.271797 1.008904 -0.031586
O  -2.222865 1.463515 0.540956
H  -2.395369 -0.76958 -0.752088
H  -2.288736 -1.006548 0.959296
H  -1.805245 -2.330896 -0.133438
H  0.419342 -2.722275 0.003486
H  2.77909 -2.018739 0.009993
H  3.333401 0.40613 -0.018706
H  1.474601 2.070118 -0.078695
totalener: -456.98683659600692 hartree
nucrepener: 484.57501763494855 hartree
electener: -941.56201887346106 hartree
oneelecener: -1596.33330038909185 hartree
twoeener: 654.77128151563079 hartree
kineticenergy: 456.67543938198480 hartree
energy: -552.4000 -552.3879 -303.4039 -302.2418 -302.1860 -302.0465 -302.0236 -301.7461 -301.5696 -301.4999 -32.2761 -29.5271 -27.7828 -24.7876 -23.9660 -21.7135 -19.0241 -18.1856 -15.9381 -14.4354 -13.7409 -12.9573 -12.4833 -11.8950 -11.8425 -11.2791 -10.8321 -10.3166 -10.0954 -9.5579 -9.4650 -6.2765 -5.9234 -5.6473 -5.3984 -5.1341 6.8164 7.1803 8.3582 8.7337 9.3685 9.7920 10.1025 10.3009 10.5884 10.9887 11.5317 electronvolt
chargesum: -1.0000000
charge: -0.857159 0.578963 0.230029 0.315801 -0.414899 -0.157107 -0.120079 -0.148851 -0.069592 -0.846714 0.094076 0.097033 0.062320 0.045383 0.054125 0.049832 0.086838
charge: 0.852256 -2.232063 -0.269313 -0.277278 0.925983 0.263587 0.230567 0.246657 0.252522 0.857354 -0.263131 -0.271311 -0.276285 -0.255815 -0.261104 -0.262804 -0.259823
qa: -0.8572 0.5790 0.2300 0.3158 -0.4149 -0.1571 -0.1201 -0.1489 -0.0696 -0.8467 0.0941 0.0970 0.0623 0.0454 0.0541 0.0498 0.0868
va: 1.5417 3.9189 2.6369 2.7479 3.6267 3.2577 3.2771 3.2732 3.3110 1.5511 0.9761 0.9734 0.9486 0.9709 0.9678 0.9716 0.9652
e0: -456.986836596 hartree
corrType: DLPNO BASED
energy: -458.956200800711 hartree
dipole: 1.969393232 0.082617342 2.052010574 -8.102632795 5.288968558 -2.813664238 -0.031344902 0.023365461 -0.007979441
dipolemethod: SCF
magnitude: 3.482458544 au
magnitude: 8.851706162 debye
