program: Gaussian 09
title: 000061285
version: EM64L-G09RevD.01
frameworkgroup: C1[X(C11H17NO2S)]
method: RPBEPBE
basis: SDD
operation: Freq
keyword: #p
keyword: freq=noraman
keyword: PBEPBE/SDD
title: #p freq=noraman PBEPBE/SDD
converged: YES YES NO NO
title: Mulliken charges:
elementType: S O O N C C C C C C C C C C C H H H H H H H H H H H H H H H H H
charge: 0.991990 -0.535217 -0.536650 -0.513449 -0.353535 -0.367872 -0.330669 -0.081941 -0.686408 -0.254718 -0.227799 0.448425 -0.358137 -0.377839 -0.798392 0.189374 0.201971 0.250078 0.217793 0.236698 0.195359 0.295976 0.206582 0.204068 0.221556 0.285886 0.283677 0.244357 0.244234 0.229450 0.229735 0.245414
chargesum: 0.00000
title: Mulliken charges with hydrogens summed into heavy atoms:
elementType: S O O N C C C C C C C C C C C
charge: 0.991990 -0.535217 -0.536650 -0.217473 0.037811 0.099999 0.101388 -0.081941 -0.054202 0.031169 0.055878 0.448425 -0.113780 -0.133604 -0.093793
polarizability: 2.14258506e+02 -1.54885782e+01 1.35114493e+02 -8.06303036e+00 -1.36273630e+01 1.34673840e+02
1716.lowfreq: -12.4077 -6.8239 -0.0013 -0.0009 0.0005 5.2085 20.1431 30.7003 38.5944
frequency: 19.9872 30.2628 38.5320 43.9373 69.1909 73.7239 112.3662 120.2285 140.3734 185.2367 225.7183 233.2725 238.3638 255.2006 282.0802 291.8782 335.0717 361.2050 380.7012 407.1684 415.8374 450.2907 498.2745 515.2176 580.0426 621.3524 706.3379 725.4140 743.0474 776.2146 813.6816 826.7841 831.2270 848.2803 850.8918 943.0675 961.1081 962.0781 973.1205 981.1870 991.5837 994.3607 1033.4727 1047.6849 1049.4980 1077.0376 1115.7452 1119.8700 1136.2363 1182.3435 1207.3434 1216.6356 1239.9247 1288.0296 1294.2219 1305.8667 1328.0191 1351.6411 1367.4859 1379.2164 1389.3794 1390.7272 1400.2373 1461.0755 1470.9639 1471.3005 1475.2993 1476.3870 1479.6817 1481.9565 1487.4937 1593.1176 1594.1723 2926.6706 2964.2525 2970.9491 2980.8581 2985.9074 3013.7745 3043.6317 3049.4845 3063.3823 3072.6055 3074.7454 3092.6254 3133.3690 3135.1948 3156.9916 3160.9169 3420.6566
redmass: 4.4279 3.0949 1.0995 2.8316 3.4356 2.0924 3.5853 4.6286 5.1727 2.9238 4.9053 1.8230 2.0146 2.6163 4.5952 4.6312 3.3393 3.5417 3.3920 2.8773 6.5777 6.8114 2.4587 2.9435 5.9413 6.9541 3.1612 1.9893 1.1354 4.5881 5.0365 1.4794 1.8307 1.5079 1.2445 3.0110 1.8029 1.2988 1.7686 1.4282 1.4910 4.6373 3.8034 2.3929 1.6241 2.6170 1.3187 1.8820 1.8597 1.1473 1.3421 2.9860 1.2707 1.1147 1.2698 1.2812 1.2223 1.3581 1.3742 5.8138 3.0429 1.2164 1.2200 1.0803 2.3472 1.0983 1.0606 1.0473 1.0440 1.0784 1.0860 6.8546 5.9858 1.0666 1.0598 1.0374 1.0390 1.0650 1.0968 1.0972 1.0955 1.0948 1.1012 1.0989 1.1001 1.0887 1.0891 1.0956 1.0967 1.0759
irintensity: 0.9032 0.1582 1.1808 0.2054 1.5046 1.4465 1.0305 2.1194 4.3808 0.7987 7.3334 0.4172 2.9848 0.3998 1.4506 6.7231 17.4147 11.5469 15.7304 0.0885 11.9755 148.4417 71.6540 26.6022 34.2035 0.1784 0.9300 23.9558 6.5918 3.2246 122.7641 29.2825 5.2646 9.1784 0.5014 49.3524 17.0223 1.4991 14.8762 2.1685 3.0259 1.5286 3.0661 31.0574 16.1402 4.7619 15.5836 7.5862 26.5761 6.8554 4.6031 6.5904 0.9815 3.9785 2.7757 1.5099 0.7655 3.9176 2.9217 0.1914 9.7555 13.3949 15.5165 2.9003 25.0302 17.5696 13.5645 4.1304 13.5007 19.3267 16.4740 0.4373 7.7203 42.1232 26.7167 53.5720 24.3053 33.9740 19.7376 2.8865 7.4684 18.3403 77.5161 52.7528 14.9691 12.8505 7.3238 3.1438 9.8933 16.6838
temp: 298.150 k
press: 1.00000 atm
elementType: 16 8 8 7 6 6 6 6 6 6 6 6 6 6 6 1 1 1 1 1 1 1 1 1 1 1 1 1 1 1 1 1
symmnumber: 1
zpe: 681943.1 jmol-1
zpe.correction: 0.259738 hartree
zpe.thermalcorrener: 0.277274 hartree
zpe.thermalcorrenthalpy: 0.278218 hartree
zpe.thermalcorrgfe: 0.211718 hartree
zpe.sumelectzpe: -1031.291841 hartree
zpe.sumelectthermal: -1031.274305 hartree
zpe.sumelectthermalent: -1031.273361 hartree
zpe.sumelectthermalfe: -1031.339861 hartree
dipole: 3.3284 -6.2076 -2.1500
dipole: 7.3644
quadrupole: -81.7090 -110.5271 -97.7032
quadrupole: 0.2318 0.0204 -4.5489
quadrupole: 14.9374 -13.8807 -1.0568 0.2318 0.0204 -4.5489
hfenergy: -1031.5515789 hartree
pointgroup: C01 [X(C11H17N1O2S1)]
dipole: -1.3064533 -2.4242143 0.9007095 debye
polarizability: 214.2183572|15.3983068|135.7591485|-8.44663|13.5897016|134.0693334 unknown
InChI: InChI=1S/C11H17NO2S/c1-3-4-9-12-15(13,14)11-7-5-10(2)6-8-11/h5-8,12H,3-4,9H2,1-2H3
charge 0 multiplicity 1
32 atoms
S  0.422695 1.418061 -0.29358
O  0.789785 1.428132 -1.876243
O  0.329084 2.751795 0.630104
N  1.738839 0.40612 0.49117
C  3.407826 -1.408009 0.356624
C  2.028916 -0.905798 -0.133037
C  4.587586 -0.522042 -0.098959
C  -1.233715 0.504521 -0.121119
C  5.944551 -1.033287 0.42982
C  -2.020944 0.766782 1.012403
C  -1.620308 -0.38002 -1.140888
C  -3.686906 -0.827785 0.132778
C  -3.253237 0.087235 1.129952
C  -2.856999 -1.048515 -0.998503
C  -5.030088 -1.523788 0.254891
H  3.403692 -1.486041 1.464043
H  3.541735 -2.440215 -0.027594
H  2.063108 -0.742791 -1.225981
H  1.246298 -1.667197 0.083404
H  4.408486 0.515053 0.238791
H  4.606486 -0.48897 -1.206912
H  1.570266 0.399797 1.51089
H  5.962684 -1.043711 1.536419
H  6.149848 -2.063527 0.081028
H  6.774982 -0.389803 0.086802
H  -1.692474 1.499005 1.757699
H  -0.988949 -0.516598 -2.025019
H  -3.889479 0.27571 2.002498
H  -3.184511 -1.743675 -1.780151
H  -5.03839 -2.488465 -0.281202
H  -5.295397 -1.713675 1.309461
H  -5.835369 -0.899598 -0.178488
