program: Gaussian 09
title: 000061273
version: EM64L-G09RevD.01
frameworkgroup: C1[X(C5Cl2F3N)]
method: RPBEPBE
basis: SDD
operation: Freq
keyword: #p
keyword: freq=noraman
keyword: PBEPBE/SDD
title: #p freq=noraman PBEPBE/SDD
converged: NO NO NO NO
title: Mulliken charges:
elementType: Cl Cl F F F N C C C C C
charge: 0.074454 0.074478 -0.133202 -0.137808 -0.137822 0.042347 0.632194 -0.398820 -0.398830 0.191510 0.191498
chargesum: 0.00000
title: Mulliken charges with hydrogens summed into heavy atoms:
polarizability: 1.23782422e+02 3.35349751e-04 8.57098704e+01 1.44974152e-04 -1.09787623e-03 2.98094036e+01
1716.lowfreq: -0.0020 -0.0019 -0.0016 1.7063 6.8890 13.0604 81.0932 102.2488 172.0019
frequency: 81.0684 102.2434 172.0019 193.7045 207.4850 285.3323 293.1788 302.4979 355.2229 377.5350 385.3300 539.9151 563.5878 604.9406 634.6364 646.1560 725.6334 725.8744 973.7041 1012.0409 1064.0582 1344.6621 1349.1980 1377.0213 1384.8898 1541.7273 1563.5598
redmass: 21.4204 21.8291 26.5494 15.1687 22.5145 21.3588 21.3792 13.7691 12.5319 21.2105 18.8649 15.7943 16.9494 12.4241 12.1569 13.3282 12.2226 14.2728 13.8662 13.7205 12.6948 12.4353 12.3882 12.3653 12.4421 12.0687 12.4268
irintensity: 0.0000 0.0363 0.0142 2.7317 0.0076 0.6895 0.1684 0.0616 0.0000 1.5375 0.0473 1.4585 0.5891 0.3992 0.0000 2.5319 12.3283 98.3745 144.9512 14.3418 4.0130 51.3488 3.4789 382.1739 31.8557 136.5405 35.3229
temp: 298.150 k
press: 1.00000 atm
elementType: 17 17 9 9 9 7 6 6 6 6 6
symmnumber: 1
zpe: 112492.1 jmol-1
zpe.correction: 0.042846 hartree
zpe.thermalcorrener: 0.052367 hartree
zpe.thermalcorrenthalpy: 0.053312 hartree
zpe.thermalcorrgfe: 0.006812 hartree
zpe.sumelectzpe: -1464.109495 hartree
zpe.sumelectthermal: -1464.099974 hartree
zpe.sumelectthermalent: -1464.099030 hartree
zpe.sumelectthermalfe: -1464.145529 hartree
dipole: -0.0001 1.6374 0.0002
dipole: 1.6374
quadrupole: -76.5064 -83.2480 -71.6317
quadrupole: -0.0006 -0.0002 -0.0003
quadrupole: 0.6223 -6.1193 5.4970 -0.0006 -0.0002 -0.0003
hfenergy: -1464.1523413 hartree
pointgroup: C01 [X(C5Cl2F3N1)]
dipole: 0.0000474 0.6442166 -0.0000867 debye
dipolederiv: -0.5143681 0.2554049 0.0000229 0.3047896 -0.1672014 -0.0000136 0.0000478 -0.0000272 0.0428668 -0.5144102 -0.2553888 -0.0000147 -0.3047794 -0.1671546 -0.0000103 -0.0000359 -0.0000157 0.0428877 -0.1382757 -0.0000014 -0.0000003 0.0000085 -0.8361907 -0.0000123 0.000006 -0.0000486 -0.0989982 -0.8110373 -0.4183625 0.0000026 -0.4284923 -0.4658319 0.0000035 0.0000667 0.0000467 -0.1467097 -0.8110309 0.4183559 -0.0000411 0.4284854 -0.4658482 0.000029 -0.0001307 0.0000843 -0.1467255 -0.7793294 -0.0000142 -0.00003 -0.0000097 -0.5036441 -0.0000317 -0.0000243 0.0000577 -0.1502693 0.2098497 -0.0000131 0.0000035 0.0000171 0.9966717 0.0000174 0.0000018 0.0000328 0.188058 0.6102624 -0.4844322 -0.0000544 -0.7187996 -0.0344479 0.0000363 -0.0000575 0.0000399 -0.0805615 0.6103426 0.4843949 0.0000246 0.7187528 -0.0345337 0.000031 0.0000123 0.0000442 -0.0805607 1.068995 0.4967766 -0.0000071 0.5754322 0.8390703 -0.0000117 -0.000061 -0.0000753 0.2150058 1.0690019 -0.4967201 0.0000941 -0.5754045 0.8391106 -0.0000376 0.0001749 -0.0001387 0.2150065 unknown
polarizability: 123.7824222|-0.0013144|85.7098705|0.000145|0.0010979|29.8094036 unknown
InChI: InChI=1S/C5Cl2F3N/c6-1-3(8)2(7)5(10)11-4(1)9
charge 0 multiplicity 1
11 atoms
Cl -2.790974 1.300793 0.000071
Cl 2.791036 1.300647 0.000031
F  0.000018 2.502404 0.000027
F  -2.315552 -1.72612 0.000014
F  2.315499 -1.726172 0.000147
N  -0.000027 -1.664842 -0.000064
C  0.000027 1.123524 -0.000061
C  -1.231223 0.427248 -0.000057
C  1.231259 0.427234 -0.000061
C  -1.150356 -0.982288 -0.000086
C  1.150293 -0.982328 -0.000061
