program: Gaussian 09
title: 000061249
version: EM64L-G09RevD.01
frameworkgroup: C1[X(C6H10O3)]
method: RPBEPBE
basis: SDD
operation: Freq
keyword: #pfreq=noraman
keyword: PBEPBE/SDD
title: #p freq=noraman PBEPBE/SDD
converged: YES YES NO NO
title: Mulliken charges:
elementType: O O O C C C C C C H H H H H H H H H H
charge: -0.268425 -0.449343 -0.252632 -0.058760 -0.248528 -0.700409 0.257261 -0.209926 -0.475845 0.206001 0.251582 0.215707 0.216408 0.215311 0.234488 0.340907 0.251798 0.227531 0.246873
chargesum: 0.00000
title: Mulliken charges with hydrogens summed into heavy atoms:
elementType: O O O C C C C C C
charge: -0.268425 -0.108436 -0.252632 0.147242 0.218761 -0.034202 0.257261 0.041872 -0.001441
polarizability: 1.14126102e+02 8.57000773e-01 6.71808248e+01 -2.91346338e+00 4.68033129e+00 5.09988490e+01
1716.lowfreq: -6.2216 -0.0013 -0.0012 -0.0009 4.2768 5.4793 25.4902 53.2372 104.5560
frequency: 25.4240 53.2129 104.5540 111.3871 206.3561 220.9816 230.5010 257.4797 262.0270 326.4555 425.7790 436.1369 506.8067 519.1463 646.9605 778.9300 813.2060 853.7787 893.5353 922.7688 977.3591 992.8338 1005.6258 1061.5897 1069.7191 1097.9595 1103.9645 1137.8323 1198.8528 1249.8451 1286.8634 1299.9694 1341.9897 1389.7695 1397.2977 1411.4984 1449.2619 1470.1465 1474.2663 1621.6518 1642.2116 2969.9471 2981.0292 3016.5489 3074.0009 3085.3841 3091.1361 3103.4548 3158.7090 3219.4139 3567.6319
redmass: 4.5746 4.2619 3.6197 2.7970 3.1339 1.3811 1.1930 1.7328 4.2588 3.0890 3.1505 2.4982 1.7847 3.6327 3.8605 3.3649 3.2850 3.9270 1.8254 1.8636 3.0752 1.4024 1.0778 1.5750 2.0513 1.9090 2.1880 4.3997 1.1417 1.1216 1.4066 1.3418 1.3060 1.2864 1.4766 1.2612 1.0808 1.0621 1.0824 11.4007 4.5719 1.0829 1.0378 1.0577 1.0994 1.1034 1.1031 1.0599 1.0958 1.1157 1.0663
irintensity: 0.6297 3.9424 2.9644 1.4409 3.6823 3.2530 89.4510 71.3536 5.1974 5.8238 12.8676 21.8570 0.1232 1.9721 2.6711 21.8411 15.0234 33.2824 21.3162 1.6758 49.9058 40.5318 45.2969 17.5028 0.1495 82.6804 10.4181 426.0443 3.7252 17.6670 37.4021 11.8854 3.6896 19.1619 7.8252 75.0566 6.8976 10.7149 11.0973 151.1978 17.7099 39.6211 19.7662 19.5489 29.4383 11.4429 45.4680 4.6844 4.0534 8.6219 5.6731
temp: 298.150 k
press: 1.00000 atm
elementType: 8 8 8 6 6 6 6 6 6 1 1 1 1 1 1 1 1 1 1
symmnumber: 1
zpe: 398016.7 jmol-1
zpe.correction: 0.151597 hartree
zpe.thermalcorrener: 0.162317 hartree
zpe.thermalcorrenthalpy: 0.163261 hartree
zpe.thermalcorrgfe: 0.114263 hartree
zpe.sumelectzpe: -459.560302 hartree
zpe.sumelectthermal: -459.549581 hartree
zpe.sumelectthermalent: -459.548637 hartree
zpe.sumelectthermalfe: -459.597635 hartree
dipole: 1.8428 -1.3479 -2.2062
dipole: 3.1749
quadrupole: -38.2065 -54.6479 -56.5544
quadrupole: 3.1888 -1.3071 0.5321
quadrupole: 11.5964 -4.8450 -6.7514 3.1888 -1.3071 0.5321
hfenergy: -459.7118981 hartree
pointgroup: C01 [X(C6H10O3)]
dipole: 0.7375295 0.4860994 0.8832019 debye
dipolederiv: -1.7328793 -0.0981555 -0.1426982 -0.114114 -0.4317645 -0.0827882 -0.158148 -0.0902591 -0.3277813 -0.4441445 0.1133323 0.1839365 0.1043853 -0.7122171 0.2050179 0.205007 0.2344002 -0.4989692 -0.6954764 0.03707 0.0017792 -0.143305 -0.805511 -0.2366277 -0.0923556 -0.2265336 -0.4403824 0.4156358 0.0081752 -0.0787085 0.0321018 0.5908981 -0.1963616 -0.0970028 -0.1690806 0.4536931 0.8082895 -0.1180098 0.0046716 -0.224744 0.2155559 -0.0402212 -0.1175026 -0.0722633 0.2768019 -0.150802 0.1291478 -0.0296803 0.0178422 -0.0700529 0.0358092 0.0126223 0.0357503 0.0330963 1.9282246 0.0241146 0.0900695 0.1743964 0.9380138 0.3348622 0.1839532 0.3273669 0.434076 -0.490025 0.1735038 0.0646095 0.0948415 -0.0099383 0.0804235 0.0281109 0.0813374 -0.1314324 0.0547251 -0.070809 -0.0147434 0.0625888 0.0019622 0.1440268 0.0522461 0.1382502 -0.2278236 0.0264535 0.027132 0.0428062 -0.00166 -0.0409786 -0.0646811 0.0555604 -0.029836 -0.17995 -0.0241345 0.0110316 -0.0119436 0.0771967 0.0764241 -0.0190225 0.0295199 -0.0409483 -0.0610545 -0.0440488 -0.0020277 0.0140807 0.0876982 -0.0669642 0.0818181 0.0260925 0.0990651 0.0181253 -0.1343073 -0.0818298 -0.0430739 -0.1277745 -0.0002978 -0.0303095 -0.0469602 -0.026958 0.0943929 0.0951937 -0.0177316 0.038196 0.0102677 -0.0381529 0.132442 0.0179465 0.135497 -0.0373546 0.0884309 0.0150057 -0.0101602 0.0430288 0.0396903 -0.0802592 0.043854 -0.1139042 -0.07808 0.1245413 -0.1790014 -0.1043951 -0.1462688 0.2789299 -0.0262791 -0.1486896 -0.0438294 0.2463782 0.0708622 -0.0422695 -0.0252464 0.0047632 -0.0128441 -0.0918435 -0.002013 -0.0934076 0.1350746 -0.0121353 0.0829119 0.0302057 0.0925932 0.0367158 -0.0599181 0.0331921 -0.0603721 0.1456518 0.1155965 -0.0115907 -0.0097053 -0.0438375 0.0105313 -0.0860881 -0.0254332 -0.0842748 0.1455378 unknown
polarizability: 114.1603332|-1.2880393|66.75537|2.2894126|5.3650623|51.3900721 unknown
InChI: InChI=1S/C6H10O3/c1-3-6(8)9-4-5(2)7/h3,5,7H,1,4H2,2H3
charge 0 multiplicity 1
19 atoms
O  -0.127375 0.289364 0.253366
O  2.458843 1.248117 -0.815139
O  -1.530098 -1.362202 -0.623026
C  2.302035 0.234896 0.247744
C  1.044348 -0.547363 -0.114079
C  3.53473 -0.687728 0.319768
C  -1.380338 -0.242013 -0.074268
C  -2.451334 0.707608 0.326152
C  -3.761778 0.416689 0.120618
H  2.141279 0.730408 1.229007
H  1.016979 -0.758829 -1.197565
H  0.984971 -1.501506 0.44026
H  4.447776 -0.1021 0.533851
H  3.425005 -1.443393 1.119692
H  3.684187 -1.210655 -0.641847
H  3.197804 1.861685 -0.573551
H  -2.122542 1.645259 0.785879
H  -4.555691 1.112983 0.409875
H  -4.051799 -0.531822 -0.346538
