program: Gaussian 09
title: 000061230
version: EM64L-G09RevD.01
frameworkgroup: C1[X(C13H10N2)]
method: RPBEPBE
basis: SDD
operation: Freq
keyword: #pfreq=noraman
keyword: PBEPBE/SDD
title: #p freq=noraman PBEPBE/SDD
converged: NO YES NO NO
title: Mulliken charges:
elementType: N N C C C C C C C C C C C C C H H H H H H H H H H
charge: -0.051940 -0.055594 0.336552 0.259634 0.021801 -0.378121 -0.355251 -0.392351 -0.355245 -0.228552 -0.219301 -0.225775 -0.219317 -0.255019 -0.232497 0.242745 0.252823 0.226540 0.252837 0.224399 0.232144 0.225309 0.232146 0.229043 0.232993
chargesum: 0.00000
title: Mulliken charges with hydrogens summed into heavy atoms:
elementType: N N C C C C C C C C C C C C C
charge: -0.051940 -0.055594 0.336552 0.259634 0.021801 -0.135376 -0.102429 -0.165811 -0.102409 -0.004152 0.012843 -0.000466 0.012828 -0.025977 0.000496
polarizability: 1.98883380e+02 -1.28757421e-01 1.69099315e+02 -1.15318147e-02 -8.52254080e-03 1.00384453e+02
1716.lowfreq: -42.9384 -7.3180 -0.0006 -0.0004 0.0007 4.0265 13.3208 46.0103 65.9264
frequency: -42.8897 45.9500 65.9167 87.1609 120.5971 197.6161 227.3945 285.1995 388.1064 390.8723 401.3253 404.2935 463.3832 465.4199 531.1653 549.1686 614.3080 617.8132 645.3988 694.8519 697.1916 703.7817 762.1631 770.1611 841.7730 855.7147 905.5286 914.7498 937.0266 973.3855 981.6890 982.4894 988.8496 990.1767 1000.3904 1022.7050 1029.1099 1075.1254 1083.5987 1110.8736 1172.6235 1173.2557 1184.8182 1195.8276 1287.7681 1306.5462 1319.3375 1334.4868 1367.5912 1378.2524 1428.0242 1441.7134 1479.1179 1486.9972 1576.8896 1582.4150 1604.5359 1608.3362 1998.8870 3119.9006 3126.5761 3127.3673 3133.2644 3140.6481 3143.9248 3150.9725 3153.7248 3165.9554 3167.2333
redmass: 4.2541 3.7916 5.2616 5.6784 9.6113 4.4325 4.5923 5.4900 6.8167 5.7495 2.8251 2.8928 4.9063 9.7413 3.8585 4.7770 6.4315 6.4730 6.8877 1.8411 6.3068 1.7475 1.7784 1.8882 1.2556 1.2428 1.4352 3.1466 1.8280 1.3761 1.3870 6.1023 6.2741 1.3085 1.3217 2.6049 2.0204 1.5994 1.8162 2.8170 1.0528 1.0543 1.1136 1.1203 3.2043 1.3734 3.8287 1.6248 7.0494 6.8740 2.1739 2.4852 2.2956 2.5143 5.8927 5.9903 6.1487 5.9116 13.8481 1.0856 1.0848 1.0865 1.0881 1.0927 1.0928 1.0950 1.0971 1.1013 1.1018
irintensity: 0.0535 0.2217 0.4735 0.0285 0.9009 0.4455 0.3300 0.1312 0.1247 1.5965 0.0094 0.0092 8.8824 0.8486 9.6117 1.9528 0.0824 0.5784 24.6127 38.3072 3.8179 56.5436 71.2836 39.4531 0.1017 0.0537 3.6950 8.0308 1.7115 0.0690 0.0237 0.7547 2.1823 0.0818 0.0680 3.9157 10.4994 9.8414 8.5566 0.2953 0.0575 0.0004 1.8469 3.2720 10.0910 0.1298 9.8407 2.4505 0.7349 8.3529 8.4595 9.6447 16.9975 53.7336 3.5264 1.7742 9.6063 52.2570 452.0341 5.7658 0.7344 1.2225 0.5166 16.6338 19.2970 30.8064 29.8857 24.4444 16.7145
temp: 298.150 k
press: 1.00000 atm
elementType: 7 7 6 6 6 6 6 6 6 6 6 6 6 6 6 1 1 1 1 1 1 1 1 1 1
symmnumber: 1
zpe: 503504.7 jmol-1
zpe.correction: 0.191775 hartree
zpe.thermalcorrener: 0.203164 hartree
zpe.thermalcorrenthalpy: 0.204109 hartree
zpe.thermalcorrgfe: 0.153389 hartree
zpe.sumelectzpe: -609.814649 hartree
zpe.sumelectthermal: -609.803259 hartree
zpe.sumelectthermalent: -609.802315 hartree
zpe.sumelectthermalfe: -609.853035 hartree
dipole: 1.1985 -2.1586 -0.0005
dipole: 2.4690
quadrupole: -74.1167 -92.5306 -84.5389
quadrupole: -3.7963 -0.0038 -0.0070
quadrupole: 9.6121 -8.8019 -0.8102 -3.7963 -0.0038 -0.0070
hfenergy: -610.0064237 hartree
pointgroup: C01 [X(C13H10N2)]
dipole: 0.4571094 0.8571042 -0.0000682 debye
dipolederiv: -0.3995121 0.1012288 -0.0000279 -0.5405044 1.9175013 -0.0001732 -0.0002648 -0.0005097 0.0700219 -0.0225843 -0.0376005 0.0000062 0.4407111 -1.3749997 0.0000824 -0.0000008 0.0003519 -0.1118998 0.573504 -0.5679544 0.0000533 -0.5940928 0.2651848 -0.0000302 0.0002287 0.000002 0.0683529 0.2664857 0.1929546 -0.0000002 0.1885133 -0.0153398 -0.0000478 0.0000387 -0.0000221 0.0794551 0.0792247 0.1711589 -0.0000186 0.5517334 -0.6479797 0.0001349 0.0000787 0.0002026 -0.1454264 -0.1174608 0.1305186 0.0000158 0.2992765 -0.2057525 0.000035 0.0000163 0.0000124 -0.1591926 -0.1020713 -0.0026336 -0.0928065 -0.0313019 -0.1266252 -0.0396461 0.0236004 0.0165302 0.0366197 -0.3124092 0.1794837 -0.0000078 0.0172548 0.0390789 -0.000004 -0.0000023 -0.0000094 -0.182501 -0.1019745 -0.0026874 0.0928988 -0.031489 -0.1266982 0.0394817 -0.0235617 -0.0166826 0.0365777 0.1183254 -0.0211504 0.0000236 -0.0762218 0.1874836 -0.0000141 0.0000482 -0.0000109 -0.139884 -0.0872877 0.0302633 0.1048414 0.0531502 -0.1133568 0.0538771 0.0827824 0.0312891 0.0687484 0.1321826 -0.0045342 0.0000194 0.0767662 0.0723382 0.000002 0.0000006 -0.0000119 -0.139572 -0.0872861 0.0303912 -0.1047262 0.0531696 -0.1133148 -0.0541107 -0.0825932 -0.0314962 0.0687468 -0.1213334 -0.0046594 0.0000032 -0.0742483 -0.116384 -0.0000122 -0.0000015 0.0000035 -0.1919624 0.0677222 0.1176977 0.000043 0.1029094 -0.0933177 -0.0000666 -0.0000054 -0.0000788 -0.029304 -0.0222423 -0.0785641 -0.0000159 -0.1193087 0.052068 -0.0000057 -0.0000575 0.0000046 0.1257853 0.0845422 -0.0299231 0.0846999 -0.0434185 0.1076367 0.0357013 0.0828992 0.0315086 -0.0237285 0.0903207 0.0370717 -0.0000085 -0.0135817 -0.0916618 0.0000038 0.0000046 0.0000164 0.1553506 0.0844625 -0.0298467 -0.0847961 -0.0433413 0.1077242 -0.0355062 -0.083018 -0.0313795 -0.0237082 0.0793028 -0.0085111 -0.0000037 0.0216311 -0.1386141 0.0000046 -0.0000099 0.0000082 0.1521748 0.0321721 -0.0579722 -0.0735739 -0.0570732 0.1258775 -0.0391175 -0.0922031 -0.0423293 -0.0635867 -0.1041042 -0.0742552 -0.0000204 -0.0988134 0.0373117 -0.0000044 -0.0000173 -0.0000005 0.1542601 0.0322568 -0.0580231 0.0734456 -0.0571262 0.125798 0.0393633 0.0920856 0.0425579 -0.063585 -0.0869394 0.0995825 -0.0000246 0.0999208 0.0297025 0.0000116 -0.0000235 0.0000107 0.1684102 -0.0752964 -0.1120354 -0.00002 -0.1245154 0.096339 0.000041 -0.0000244 0.0000325 0.0898471 unknown
polarizability: 198.8705042|0.632342|169.1121761|0.0191886|-0.0309782|100.3844679 unknown
InChI: InChI=1S/C13H10N2/c14-15-13(11-7-3-1-4-8-11)12-9-5-2-6-10-12/h1-10H
charge 0 multiplicity 1
25 atoms
N  -0.056483 -2.188578 0.000329
N  -0.074683 -3.378233 0.000599
C  -1.325277 -0.12973 0.000046
C  1.305821 -0.198831 0.000172
C  -0.045719 -0.861603 0.00017
C  -1.319161 1.296391 0.000019
C  1.946322 0.126214 1.224353
C  -2.585231 -0.802291 -0.000032
C  1.945646 0.127522 -1.22401
C  -2.53028 2.018837 -0.000103
C  3.207584 0.763896 1.224154
C  -3.78891 -0.071151 -0.000145
C  3.206902 0.765217 -1.223828
C  -3.773224 1.344617 -0.000196
C  3.840335 1.08325 0.000159
H  -0.36373 1.831549 0.000107
H  1.451293 -0.120207 2.170354
H  -2.62303 -1.898398 0.000001
H  1.450111 -0.117906 -2.170004
H  -2.502058 3.114563 -0.000124
H  3.694344 1.008902 2.174577
H  -4.744667 -0.607749 -0.000204
H  3.693131 1.01124 -2.17426
H  -4.711757 1.909124 -0.000288
H  4.819522 1.575157 0.000155
