program: Gaussian 09
title: 000007350
version: EM64L-G09RevD.01
frameworkgroup: C1[X(C8H20N2)]
method: RPBEPBE
basis: SDD
operation: Freq
keyword: #pfreq=noraman
keyword: PBEPBE/SDD
title: #p freq=noraman PBEPBE/SDD
converged: YES YES NO NO
title: Mulliken charges:
elementType: N N C C C C C C C C H H H H H H H H H H H H H H H H H H H H
charge: -0.111326 -0.082953 0.028724 -0.462783 -0.372943 -0.766195 -0.629148 -0.638374 -0.627163 -0.615431 0.179033 0.205764 0.231657 0.250318 0.187041 0.234815 0.211528 0.219834 0.242429 0.184379 0.215702 0.213626 0.187727 0.249235 0.236704 0.182432 0.217574 0.226591 0.217633 0.183572
chargesum: 0.00000
title: Mulliken charges with hydrogens summed into heavy atoms:
elementType: N N C C C C C C C C
charge: -0.111326 -0.082953 0.207757 -0.025362 0.064416 -0.100019 0.013362 0.012214 0.009547 0.012364
polarizability: 1.17994322e+02 4.37110985e-01 9.89723721e+01 1.48281980e+00 4.43430452e-01 8.98791069e+01
1716.lowfreq: -19.6691 -8.4274 -0.0005 -0.0001 0.0002 8.8925 32.0671 53.3649 63.7456
frequency: 31.7778 53.3440 63.6857 132.3032 142.4898 201.0240 205.5432 224.1823 241.3674 248.8018 258.0270 293.7961 337.2247 348.0564 394.8476 417.3616 436.0838 444.2975 474.3214 594.6281 722.2852 796.9744 820.3426 880.7635 960.9769 976.8285 996.3588 1031.8221 1033.1497 1044.2973 1072.7630 1083.4956 1090.9533 1103.7170 1127.7670 1134.7543 1145.8163 1169.0549 1219.7753 1230.9126 1254.8348 1264.9011 1289.6143 1296.6972 1335.9643 1339.3501 1375.2769 1382.7174 1415.1296 1416.9461 1439.4159 1443.1215 1456.5634 1460.1581 1465.6415 1467.2257 1472.5016 1475.4711 1477.3143 1481.6768 1484.5448 1485.9226 1493.5670 1503.6891 2799.4203 2830.3568 2834.6285 2840.3371 2854.7181 2857.3299 2987.2553 2993.8820 3015.2520 3024.3562 3030.5435 3031.9700 3033.7877 3052.1820 3074.8797 3080.1448 3082.9987 3087.9525 3089.4677 3094.1550
redmass: 2.7296 2.7271 2.7444 2.3743 2.6030 1.1401 1.1900 1.9258 1.2477 1.1852 1.1772 2.5427 2.2321 1.6888 2.3713 2.0529 2.5334 2.2178 2.4145 3.0133 2.5669 1.3329 3.3762 2.8356 1.8648 1.5766 2.0229 1.5461 1.5765 1.8576 1.7373 1.2868 1.3368 1.6496 1.7588 1.7916 1.6427 1.7191 2.7784 1.5781 2.3485 2.4055 1.2304 1.7836 1.4344 1.3012 1.3982 1.2462 1.1387 1.1441 1.1724 1.1725 1.0569 1.0513 1.0534 1.0524 1.0567 1.0501 1.0565 1.0679 1.0538 1.0529 1.0629 1.0616 1.0808 1.0689 1.0577 1.0579 1.0589 1.0580 1.0371 1.0603 1.0715 1.0713 1.0739 1.0804 1.0763 1.1002 1.1009 1.0995 1.1003 1.0995 1.0995 1.0989
irintensity: 0.5252 0.9400 0.7542 0.2417 0.6698 0.2799 0.0979 0.9802 0.3530 1.3626 0.0418 7.0800 11.3665 0.4530 2.2971 0.3570 1.0855 2.5168 0.6865 1.2112 5.7712 2.5386 17.6355 19.2627 12.7493 4.9831 15.0358 25.6186 14.0320 33.3207 3.9038 5.3681 4.0380 19.7000 1.8315 5.2419 7.5814 21.4991 11.2790 3.0620 4.6518 5.6752 0.7142 36.0451 4.9728 15.2221 5.3846 18.0824 2.3699 3.3049 1.7761 14.4476 2.2938 20.3028 15.4435 19.0511 12.8688 15.4753 4.2562 12.1265 0.9183 32.3612 9.3459 1.9028 82.8705 52.7289 76.1883 81.5309 323.4771 130.0099 25.4649 26.6477 42.1905 58.4897 16.5694 37.2864 25.2647 43.8458 30.9965 55.0541 41.5555 29.2532 50.9768 26.5506
temp: 298.150 k
press: 1.00000 atm
elementType: 7 7 6 6 6 6 6 6 6 6 1 1 1 1 1 1 1 1 1 1 1 1 1 1 1 1 1 1 1 1
symmnumber: 1
zpe: 716921.0 jmol-1
zpe.correction: 0.273061 hartree
zpe.thermalcorrener: 0.286481 hartree
zpe.thermalcorrenthalpy: 0.287425 hartree
zpe.thermalcorrgfe: 0.233295 hartree
zpe.sumelectzpe: -425.436818 hartree
zpe.sumelectthermal: -425.423397 hartree
zpe.sumelectthermalent: -425.422453 hartree
zpe.sumelectthermalfe: -425.476583 hartree
dipole: -0.4892 0.6668 0.0321
dipole: 0.8276
quadrupole: -61.4330 -64.8342 -66.6107
quadrupole: 1.5373 -1.2289 0.9284
quadrupole: 2.8596 -0.5415 -2.3181 1.5373 -1.2289 0.9284
hfenergy: -425.7098784 hartree
pointgroup: C01 [X(C8H20N2)]
dipole: 0.1918028 0.2621462 -0.0225834 debye
polarizability: 117.9742032|-0.308056|98.9152421|1.6977156|-0.8304488|89.9563559 unknown
InChI: InChI=1S/C8H20N2/c1-8(10(4)5)6-7-9(2)3/h8H,6-7H2,1-5H3
charge 0 multiplicity 1
30 atoms
N  1.913622 -0.500488 0.178208
N  -2.372817 -0.349812 -0.077642
C  1.350146 0.748155 -0.426672
C  -0.144938 0.568466 -0.815209
C  -1.045935 0.148347 0.365472
C  1.525461 1.958554 0.522463
C  3.313292 -0.347194 0.634221
C  1.785846 -1.676882 -0.712559
C  -3.196107 0.690069 -0.727927
C  -3.10354 -1.004549 1.026698
H  1.901984 0.980989 -1.379411
H  -0.483987 1.529605 -1.247886
H  -0.253196 -0.189578 -1.612855
H  -0.535637 -0.667386 0.909884
H  -1.151957 1.002274 1.085363
H  1.161789 1.714128 1.536393
H  0.942467 2.816894 0.14233
H  2.577785 2.282649 0.598912
H  3.382133 0.4084 1.433168
H  4.018157 -0.052746 -0.186292
H  3.663218 -1.307855 1.052605
H  2.247534 -2.553043 -0.223336
H  2.285103 -1.534021 -1.705582
H  0.725408 -1.917117 -0.893908
H  -2.685385 1.077547 -1.625704
H  -3.420234 1.558177 -0.053739
H  -4.157656 0.251312 -1.050508
H  -2.49197 -1.82644 1.439941
H  -4.047154 -1.436328 0.646108
H  -3.358029 -0.308126 1.867463
