program: Gaussian 09
title: 000073059
version: EM64L-G09RevD.01
frameworkgroup: C1[X(C15H14O6)]
method: RPBEPBE
basis: SDD
operation: Freq
keyword: #pfreq=noraman
keyword: PBEPBE/SDD
title: #p freq=noraman PBEPBE/SDD
converged: YES YES NO NO
title: Mulliken charges:
elementType: O O O O O O C C C C C C C C C C C C C C C H H H H H H H H H H H H H H
charge: -0.190272 -0.378161 -0.494208 -0.486486 -0.435725 -0.473244 -0.580006 -0.526915 0.566589 0.125069 0.242639 -0.569536 -0.421575 0.072810 -0.303116 0.179257 -0.322657 -0.019465 0.130790 -0.403262 0.215643 0.233292 0.230744 0.243287 0.242258 0.231653 0.235971 0.254722 0.248026 0.228603 0.389310 0.371032 0.402393 0.381237 0.379300
chargesum: 0.00000
title: Mulliken charges with hydrogens summed into heavy atoms:
elementType: O O O O O O C C C C C C C C C C C C C C C
charge: -0.190272 0.011149 -0.123176 -0.084093 -0.054488 -0.093943 -0.115969 -0.041370 0.566589 0.125069 0.242639 -0.337883 -0.185603 0.072810 -0.048394 0.179257 -0.074631 -0.019465 0.130790 -0.174659 0.215643
polarizability: 2.70275111e+02 -9.55171672e+00 1.73441285e+02 -3.71087333e-01 -5.00529873e+00 1.31048650e+02
1716.lowfreq: -3.6387 0.0007 0.0007 0.0009 3.6943 9.0771 14.9939 19.9687 33.6905
frequency: 14.8432 19.4031 33.6562 35.2156 68.6209 107.4120 116.0357 152.7717 153.1572 205.1418 236.4034 262.3856 265.9498 269.7052 275.5737 284.2131 296.0214 300.4815 313.9775 315.0285 359.8127 409.7998 412.9306 435.8578 444.3819 476.0098 497.7547 506.7952 507.9951 551.6022 562.8153 569.4738 574.4586 596.0437 613.6222 619.8648 671.5672 713.0744 714.6500 736.5490 754.1536 758.4043 786.0742 800.4000 821.4076 842.0167 869.6649 910.3027 931.3170 939.9917 959.6902 1002.7019 1032.2038 1072.0689 1081.5428 1120.7347 1124.7172 1139.2759 1158.3936 1161.4083 1183.7462 1207.6730 1227.3455 1229.5495 1236.1995 1269.8738 1275.0447 1279.3884 1290.2025 1315.2828 1334.4234 1344.8223 1408.4247 1431.0907 1431.3757 1437.3293 1468.1759 1476.2775 1494.3328 1519.8890 1576.8654 1607.5544 1615.5810 1625.9557 1635.6511 2969.2550 3011.0813 3019.3031 3070.4559 3107.4028 3129.9691 3136.5239 3169.2490 3178.9370 3460.2001 3528.6869 3572.9079 3620.0516 3622.3118
redmass: 6.6247 5.2533 6.6444 6.1263 4.6839 7.0486 2.8080 7.5304 7.9055 5.9351 5.8417 1.2435 3.0703 4.4673 3.0104 3.5412 2.3844 3.6637 2.5304 4.8377 8.5556 4.8708 1.1200 3.9726 3.1822 1.1336 9.6925 4.4724 3.1935 1.1530 3.8762 6.2381 4.3661 5.7212 3.1505 4.4660 8.0294 3.7578 6.9272 4.9770 2.0773 2.3684 3.6677 1.6164 1.5243 1.7576 3.7476 1.3474 2.6561 1.5107 4.1256 2.0394 3.8940 2.3358 2.8355 1.3505 1.3631 1.1618 1.3887 1.3719 1.4099 1.8312 2.2408 2.0148 2.3986 1.3640 1.8622 1.9610 2.0643 1.8107 1.6236 1.8358 3.9684 5.0087 3.9900 1.1110 1.1069 3.7956 2.9332 3.2623 8.6010 7.7846 6.4971 7.2219 7.0617 1.0598 1.0607 1.0984 1.1027 1.0913 1.0895 1.0899 1.0952 1.0934 1.0644 1.0649 1.0656 1.0667 1.0666
irintensity: 0.3266 1.5139 2.1294 3.5635 0.8006 0.9901 1.1627 0.9342 1.5257 1.3572 8.5542 132.6946 63.5953 19.2367 6.9288 20.3701 42.8549 18.0755 51.0765 13.5282 2.0342 12.7047 180.2380 31.2479 24.7806 108.5301 4.4654 11.2038 3.7292 110.5744 11.9057 34.9579 4.3613 10.1707 5.5097 21.9578 14.5816 3.5196 4.5173 0.2637 27.3691 44.9223 22.7010 1.2420 22.9014 24.4621 95.7795 0.5683 16.5189 2.8549 54.9018 1.5285 180.1039 159.6290 119.8484 17.9376 3.3844 3.3103 26.4741 32.2123 238.8667 44.5533 308.6540 138.3227 61.5211 51.0688 279.4462 15.2608 42.1083 78.1044 97.3326 8.2200 23.7112 7.1028 44.9525 8.6497 10.7462 97.0923 15.3305 114.3252 182.6626 14.9768 20.7430 8.6309 143.3336 20.0649 15.2794 5.4369 16.3646 14.9363 12.5470 9.5306 7.2531 4.3909 84.6909 84.3138 106.2975 83.6506 46.1035
temp: 298.150 k
press: 1.00000 atm
elementType: 8 8 8 8 8 8 6 6 6 6 6 6 6 6 6 6 6 6 6 6 6 1 1 1 1 1 1 1 1 1 1 1 1 1 1
symmnumber: 1
zpe: 684777.8 jmol-1
zpe.correction: 0.260818 hartree
zpe.thermalcorrener: 0.280895 hartree
zpe.thermalcorrenthalpy: 0.281839 hartree
zpe.thermalcorrgfe: 0.209993 hartree
zpe.sumelectzpe: -1029.798414 hartree
zpe.sumelectthermal: -1029.778337 hartree
zpe.sumelectthermalent: -1029.777393 hartree
zpe.sumelectthermalfe: -1029.849239 hartree
dipole: 3.9795 5.2949 2.3095
dipole: 7.0147
quadrupole: -110.4358 -121.3228 -112.5748
quadrupole: 22.1706 -13.3256 -0.8777
quadrupole: 4.3420 -6.5450 2.2030 22.1706 -13.3256 -0.8777
hfenergy: -1030.059232 hartree
pointgroup: C01 [X(C15H14O6)]
dipole: -1.6093743 2.2418594 0.021567 debye
polarizability: 269.9330066|11.1307119|163.2491159|2.0598896|18.9870708|141.5829235 unknown
InChI: InChI=1S/C15H14O6/c16-10(9-3-6-12(18)15(21)14(9)20)4-1-8-2-5-11(17)13(19)7-8/h2-3,5-7,17-21H,1,4H2
charge 0 multiplicity 1
35 atoms
O  -1.116348 -2.188099 -0.909698
O  -3.8459 -1.922127 -0.997174
O  5.530577 1.366679 -1.715466
O  -5.98636 -0.435488 -0.398078
O  6.531877 1.192646 0.789685
O  -5.801943 2.003289 0.839029
C  1.486839 -1.364825 -0.376607
C  0.306645 -0.431165 -0.013685
C  2.83004 -0.716752 -0.075956
C  -1.062857 -1.046395 -0.366705
C  -2.289638 -0.247199 -0.051341
C  3.52596 0.001822 -1.084376
C  3.402572 -0.781481 1.220275
C  -3.606799 -0.708742 -0.371516
C  -2.181552 1.023996 0.590385
C  4.748869 0.630731 -0.790008
C  4.631309 -0.147941 1.516522
C  -4.730662 0.092788 -0.047018
C  5.311067 0.564678 0.511541
C  -3.297131 1.816809 0.91306
C  -4.585735 1.337611 0.587044
H  1.374566 -2.310047 0.184527
H  1.407347 -1.636151 -1.444639
H  0.420815 0.537264 -0.542101
H  0.342362 -0.192422 1.068292
H  3.107935 0.057013 -2.09899
H  2.887138 -1.343816 2.007755
H  -1.189661 1.403278 0.846515
H  5.078397 -0.203209 2.513546
H  -3.167868 2.785922 1.407972
H  -4.831477 -2.024757 -1.114975
H  5.135382 1.356057 -2.619444
H  -6.704639 0.191173 -0.128181
H  6.860644 1.62659 -0.041272
H  -5.66377 2.869469 1.291482
