program: Gaussian 09
title: 000061193
version: EM64L-G09RevD.01
frameworkgroup: C1[X(C3Cl2F6)]
method: RPBEPBE
basis: SDD
operation: Freq
keyword: #pfreq=noraman
keyword: PBEPBE/SDD
title: #p freq=noraman PBEPBE/SDD
converged: YES YES NO NO
title: Mulliken charges:
elementType: Cl Cl F F F F F F C C C
charge: 0.132941 0.105829 -0.108029 -0.099283 -0.099224 -0.127962 -0.123743 -0.123226 -0.117927 0.096325 0.464298
chargesum: 0.00000
title: Mulliken charges with hydrogens summed into heavy atoms:
polarizability: 4.64427231e+01 2.55842039e+00 5.45281344e+01 4.76373090e+00 -3.36934823e+00 5.78647772e+01
1716.lowfreq: -4.7309 0.0023 0.0027 0.0033 8.4755 11.0692 32.7484 78.6909 138.0061
frequency: 32.6706 78.6860 138.0061 161.9864 183.5686 229.6939 263.7190 279.0942 289.9426 292.9336 345.7841 379.4827 399.9189 427.4810 481.2955 517.5496 558.3426 641.9758 815.3524 867.1965 928.7685 989.0033 1007.5463 1067.4692 1080.9289 1112.9833 1171.6397
redmass: 21.0101 22.4676 22.3323 25.5457 22.6611 19.1600 19.8039 19.2358 20.0698 19.0133 22.2785 22.1068 20.4162 19.5099 18.7001 17.9375 17.3029 17.1022 13.1901 13.4022 13.5069 13.3427 13.2919 13.0704 13.0089 12.5197 12.3262
irintensity: 0.0245 0.0368 0.8025 0.5094 1.3953 1.8564 0.3059 1.4394 0.2307 0.5403 1.3820 0.6246 2.2039 6.8103 6.4869 5.2700 13.5141 28.7377 150.3199 139.1599 168.6681 20.4074 45.7799 226.7894 207.1957 129.1037 122.1354
temp: 298.150 k
press: 1.00000 atm
elementType: 17 17 9 9 9 9 9 9 6 6 6
symmnumber: 1
zpe: 88182.8 jmol-1
zpe.correction: 0.033587 hartree
zpe.thermalcorrener: 0.044651 hartree
zpe.thermalcorrenthalpy: 0.045595 hartree
zpe.thermalcorrgfe: -0.004473 hartree
zpe.sumelectzpe: -1632.600014 hartree
zpe.sumelectthermal: -1632.588951 hartree
zpe.sumelectthermalent: -1632.588006 hartree
zpe.sumelectthermalfe: -1632.638074 hartree
dipole: -0.3665 0.4163 -1.1028
dipole: 1.2344
quadrupole: -76.2381 -74.1676 -75.0865
quadrupole: 0.8072 1.3139 -0.7021
quadrupole: -1.0741 0.9964 0.0776 0.8072 1.3139 -0.7021
hfenergy: -1632.6336012 hartree
pointgroup: C01 [X(C3Cl2F6)]
dipole: 0.1010417 -0.0358905 -0.4736639 debye
dipolederiv: -0.0845468 -0.0057797 0.0091112 -0.0066474 -0.2376212 -0.2283811 -0.0025311 -0.1872638 -0.2990781 -0.1229181 -0.0924318 0.0891966 -0.0455934 -0.2624396 0.2358965 0.0401188 0.2418882 -0.4215157 -0.3033875 -0.0499273 0.0716392 -0.0437076 -0.3205438 0.2542585 0.0456483 0.0777969 -0.6958367 -0.3174335 -0.1140292 -0.0672649 -0.0107199 -0.4440135 -0.276729 0.0463711 -0.2003746 -0.6978855 -0.5921148 0.290141 -0.1098113 0.1799072 -0.5571271 0.119898 -0.0633702 0.094448 -0.2937366 -0.3450947 0.072126 -0.0538362 0.041633 -0.3861058 0.1871391 0.0029691 0.1911243 -0.6153075 -0.3452792 0.1060844 0.0823341 0.0210648 -0.5770167 -0.2990011 -0.0320155 -0.2416775 -0.489172 -0.693864 -0.2424341 0.0977804 -0.1561811 -0.4450726 0.0381704 0.0578119 0.0434578 -0.2577521 0.278781 0.1038791 -0.1413222 0.0335179 0.5724472 -0.0179664 0.018774 0.3265997 1.0047537 1.0838962 -0.0934235 0.2181387 -0.0254506 1.269776 -0.0885981 -0.1259577 -0.2876953 1.450935 1.4419614 0.025795 -0.1959656 0.012177 1.387717 0.0753133 0.0121814 -0.0583035 1.3145955 unknown
polarizability: 44.6195593|2.3314835|54.2435206|-2.7870295|1.3000181|59.9725548 unknown
InChI: InChI=1S/C3Cl2F6/c4-1(6,2(5,7)8)3(9,10)11
charge 0 multiplicity 1
11 atoms
Cl -0.011676 -1.826787 -1.290775
Cl 1.64804 1.205208 -1.408538
F  -0.123054 -1.266684 1.319229
F  1.370918 1.037294 1.230734
F  2.376633 -0.735751 0.250916
F  -1.440622 0.898012 -1.302889
F  -1.348004 1.300219 0.925213
F  -2.452529 -0.517147 0.1473
C  -0.028041 -0.582271 0.072923
C  1.335325 0.197292 0.102249
C  -1.32689 0.290515 -0.046461
