program: Gaussian 09
title: 000073023
version: EM64L-G09RevD.01
frameworkgroup: C1[X(C8H7N3O)]
method: RPBEPBE
basis: SDD
operation: Freq
keyword: #pfreq=noraman
keyword: PBEPBE/SDD
title: #p freq=noraman PBEPBE/SDD
converged: NO YES NO NO
title: Mulliken charges:
elementType: O N N N C C C C C C C C H H H H H H H
charge: -0.261518 -0.232189 -0.092577 -0.007294 0.160982 0.047461 0.220291 -0.318932 -0.297035 -0.222272 -0.200071 -0.595990 0.277915 0.265536 0.240456 0.240617 0.251482 0.251484 0.271650
chargesum: 0.00000
title: Mulliken charges with hydrogens summed into heavy atoms:
elementType: O N N N C C C C C C C C
charge: -0.261518 -0.232189 -0.092577 -0.007294 0.160982 0.047461 0.220291 -0.041016 -0.031498 0.018185 0.040546 0.178626
polarizability: 1.67084931e+02 -1.92510842e-01 1.17490586e+02 -1.87480746e-02 5.94175385e-03 4.78225201e+01
1716.lowfreq: -77.7633 -0.0010 -0.0008 -0.0007 8.5581 14.2475 17.3214 88.6784 129.8105
frequency: -77.7097 88.6776 129.8053 221.4073 260.6032 271.8037 330.6567 422.5625 429.8843 464.7841 481.0674 515.4193 563.1401 604.8958 674.9965 677.7254 758.8182 779.0106 791.7011 851.5691 884.0298 901.9024 952.7484 984.2478 1009.7250 1024.2467 1091.8505 1124.7985 1144.2191 1169.8917 1190.7052 1210.9441 1254.1684 1279.1953 1371.5042 1407.0404 1421.0415 1443.5022 1462.3596 1475.2531 1476.4011 1566.2852 1612.5399 1614.8086 3013.5308 3109.0643 3139.7666 3140.7044 3155.3516 3169.8665 3178.9474
redmass: 1.0283 4.5238 4.7375 6.5677 4.2144 4.7854 4.2772 3.5004 5.9695 4.5109 8.1831 7.1559 9.6080 5.0349 6.4992 4.3224 6.9731 3.7841 1.4961 8.0464 3.6580 1.4457 6.5538 1.3764 1.3421 2.0943 2.3623 1.3100 1.9363 1.2838 2.3292 2.2725 8.1090 1.6837 4.4999 7.3889 1.2810 2.5213 2.4745 1.1345 1.0456 6.9325 8.1360 8.4591 1.0328 1.1027 1.1017 1.0867 1.0906 1.0957 1.0997
irintensity: 0.0010 9.9343 0.0844 2.1440 2.4172 0.0336 10.7253 0.8638 4.8142 0.0026 5.3595 3.2309 2.7268 6.7506 1.7297 26.5126 16.2667 21.0733 57.3213 29.5873 59.0300 0.1765 40.4227 3.0138 0.0843 6.0545 11.3373 0.5466 11.4151 15.5004 1.0745 20.7127 42.8943 4.4230 14.8082 5.1264 51.1606 19.7511 0.2036 24.7885 19.8948 15.5288 85.9432 166.0570 30.4628 15.4835 0.2082 3.8311 6.8311 5.6343 15.3853
temp: 298.150 k
press: 1.00000 atm
elementType: 8 7 7 7 6 6 6 6 6 6 6 6 1 1 1 1 1 1 1
symmnumber: 1
zpe: 366650.4 jmol-1
zpe.correction: 0.139650 hartree
zpe.thermalcorrener: 0.148401 hartree
zpe.thermalcorrenthalpy: 0.149345 hartree
zpe.thermalcorrgfe: 0.105634 hartree
zpe.sumelectzpe: -547.655611 hartree
zpe.sumelectthermal: -547.646860 hartree
zpe.sumelectthermalent: -547.645915 hartree
zpe.sumelectthermalfe: -547.689626 hartree
dipole: 2.1180 0.2815 -0.0008
dipole: 2.1367
quadrupole: -51.7028 -79.3205 -70.3167
quadrupole: 1.8598 0.0018 -0.0027
quadrupole: 15.4105 -12.2072 -3.2033 1.8598 0.0018 -0.0027
hfenergy: -547.7952604 hartree
pointgroup: C01 [X(C8H7N3O1)]
dipole: 0.8359026 0.088984 -0.0003269 debye
dipolederiv: -0.5620191 0.204133 0.0000648 0.3531004 -1.1008719 0.0000025 -0.0000196 -0.000375 -0.3659815 -0.2519334 -0.3343885 0.0001858 0.7144951 -1.0003525 -0.000251 -0.0010113 -0.0002874 -0.0938465 -0.4557814 0.3256629 0.0000928 0.2415069 -0.2047146 0.0000872 -0.0000449 -0.0001158 -0.1697945 0.1762724 -0.4180931 -0.000125 -0.7874487 0.5671872 0.0000395 0.0002053 0.0001544 -0.1467387 -0.3123576 0.2405164 -0.0000293 0.2686489 -0.1278174 -0.0000849 0.0000628 -0.0000152 0.0216023 0.2581053 0.0571343 0.0000059 -0.2053198 -0.0252399 -0.0000626 -0.000001 0.0000827 0.1053711 0.6457721 0.0392555 -0.0000659 -0.3531214 1.4022702 0.000284 -0.000268 0.0004188 0.2550765 -0.2007545 -0.168238 0.0000193 0.0058663 0.0503731 0.0000026 0.0000377 0.000011 -0.1150729 -0.2040131 -0.0598786 0.0000285 -0.1172873 0.1372668 -0.0000011 -0.0000215 -0.0000038 -0.1169764 0.0854399 0.2059313 -0.0000167 0.047316 -0.0016988 0. -0.0000195 -0.0000087 -0.1376516 0.1959016 -0.0653176 -0.0000135 -0.0373107 0.0144355 -0.0000234 -0.000018 -0.000001 -0.1404499 0.427955 0.0091467 -0.0007004 -0.1127796 0.0278487 0.0002317 0.0003631 0.0005139 0.1941484 0.0990817 0.0517798 -0.0000018 -0.01177 0.0043563 0.0000026 0.0000044 -0.0000062 0.1585798 0.1015925 -0.0005167 0.0000027 0.0454724 -0.0265866 0.000005 0.0000115 0.0000134 0.1645055 -0.0231798 -0.0890327 0.0000083 -0.100199 0.0117885 0.000007 0.0000147 0.0000006 0.160845 -0.0943617 0.0585806 0.000006 0.0579464 0.0804075 0.0000009 0.0000038 0. 0.1579785 -0.008154 -0.0132735 0.0316634 -0.0523985 0.0975137 0.0881003 0.0905665 0.0608423 -0.0352321 -0.0070401 -0.0135351 -0.0314508 -0.0537298 0.0963133 -0.0894096 -0.0899167 -0.0618939 -0.03301 0.1294743 -0.0298667 0.0003262 0.0970126 -0.0024791 0.0010694 0.0000509 0.0006699 0.136647 unknown
polarizability: 167.0411107|-1.4860645|117.5344069|-0.0185866|0.006429|47.8225201 unknown
InChI: InChI=1S/C8H7N3O/c1-11-8(12)6-4-2-3-5-7(6)9-10-11/h2-5H,1H3
charge 0 multiplicity 1
19 atoms
O  -1.476199 2.149058 0.000558
N  -1.993356 -0.146656 -0.000137
N  -0.39514 -1.88265 -0.000046
N  -1.656312 -1.529795 -0.000121
C  0.331162 0.508722 -0.000008
C  0.624745 -0.8898 0.000025
C  -1.077245 0.947366 0.000031
C  1.388462 1.451562 -0.00003
C  1.972865 -1.33655 0.000026
C  2.721784 1.002231 -0.000055
C  3.012817 -0.391685 -0.000018
C  -3.448678 0.095669 0.000032
H  1.137508 2.516861 -0.000011
H  2.164028 -2.413736 0.000064
H  3.542215 1.727565 -0.000087
H  4.054829 -0.728791 -0.000033
H  -3.902562 -0.34852 0.900749
H  -3.90393 -0.358565 -0.894886
H  -3.606091 1.184013 -0.005552
