program: Gaussian 09
title: 000061172
version: EM64L-G09RevD.01
frameworkgroup: C1[X(CH2N2O4)]
method: RPBEPBE
basis: SDD
operation: Freq
keyword: #pfreq=noraman
keyword: PBEPBE/SDD
title: #p freq=noraman PBEPBE/SDD
converged: NO YES NO NO
title: Mulliken charges:
elementType: O O O O N N C H H
charge: -0.153715 -0.153773 -0.155082 -0.155115 0.154951 0.154774 -0.272976 0.290867 0.290068
chargesum: 0.00000
title: Mulliken charges with hydrogens summed into heavy atoms:
elementType: O O O O N N C
charge: -0.153715 -0.153773 -0.155082 -0.155115 0.154951 0.154774 0.307960
polarizability: 4.85708133e+01 -2.78916277e-03 5.65905789e+01 5.26132546e-03 1.36240546e-01 2.55323796e+01
1716.lowfreq: -8.4162 0.0007 0.0012 0.0015 11.4608 11.8632 12.3377 31.2485 169.3610
frequency: -5.9196 30.9245 169.3606 362.9054 458.5291 518.1342 534.6802 633.2488 747.9041 810.7301 854.6735 1016.7926 1133.1044 1145.0281 1231.4805 1302.0561 1422.9157 1436.0380 1436.4912 3097.2909 3201.5013
redmass: 15.8296 7.9335 12.6586 10.7708 2.1088 9.1586 14.0699 6.7430 14.0198 9.7083 9.4863 1.8778 1.2063 6.8627 12.7560 1.2929 1.0871 5.2141 10.6850 1.0533 1.1168
irintensity: 0.0018 3.7625 5.6142 0.0006 0.2724 15.5529 0.3918 12.8167 11.8318 93.5293 0.0341 11.6598 1.6263 222.8603 35.5526 2.1863 8.8699 5.2712 287.0272 0.0630 4.1009
temp: 298.150 k
press: 1.00000 atm
elementType: 8 8 8 8 7 7 6 1 1
symmnumber: 1
zpe: 128860.5 jmol-1
zpe.correction: 0.049080 hartree
zpe.thermalcorrener: 0.054913 hartree
zpe.thermalcorrenthalpy: 0.055857 hartree
zpe.thermalcorrgfe: 0.017876 hartree
zpe.sumelectzpe: -448.960948 hartree
zpe.sumelectthermal: -448.955116 hartree
zpe.sumelectthermalent: -448.954172 hartree
zpe.sumelectthermalfe: -448.992153 hartree
dipole: 0.0001 -0.0882 3.7115
dipole: 3.7126
quadrupole: -47.4843 -44.7757 -34.6416
quadrupole: 0.0006 -0.0040 -0.0859
quadrupole: -5.1837 -2.4752 7.6589 0.0006 -0.0040 -0.0859
hfenergy: -449.0100286 hartree
pointgroup: C01 [X(C1H2N2O4)]
dipole: -0.0000547 -0.0387699 1.4601251 debye
dipolederiv: -0.4192352 -0.1501734 0.1186645 -0.1189313 -0.6559815 -0.018877 0.2215252 0.0878911 -0.2396179 -0.4186841 0.1493737 -0.1183108 0.1198844 -0.656146 -0.0197494 -0.2225828 0.0891172 -0.2400367 -0.4283899 0.1550338 0.1191319 0.1211343 -0.6523065 0.0135899 0.2290211 -0.0934022 -0.2403049 -0.4276966 -0.1540687 -0.118833 -0.1219192 -0.6526169 0.0141946 -0.2301111 -0.0948789 -0.2407757 1.0522819 -0.0030898 -0.4215563 0.0096614 1.1841084 0.0065847 -0.8199153 0.0046222 0.2790273 1.0518067 0.0029778 0.4213627 -0.009754 1.1846199 0.0068901 0.8204071 0.0049866 0.279496 -0.5223529 -0.0000571 -0.0004393 -0.0000442 0.1064752 -0.0006522 0.0012896 0.0021772 0.2262991 0.0588994 -0.0000962 -0.0000068 -0.0001036 0.0714313 -0.0503224 0.00018 0.0027587 0.0867786 0.0533708 0.0000999 -0.000013 0.0000722 0.0704161 0.0483417 0.0001862 -0.0032719 0.0891341 unknown
polarizability: 48.570813|-0.0032749|56.5895803|0.006609|0.2226278|25.5333785 unknown
InChI: InChI=1S/CH2N2O4/c4-2(5)1-3(6)7/h1H2
charge 0 multiplicity 1
9 atoms
O  1.689479 1.154473 -0.258526
O  -1.689363 1.154155 -0.259224
O  1.722278 -1.13942 -0.281024
O  -1.721452 -1.139728 -0.282106
N  1.242063 -0.002253 0.069284
N  -1.243611 -0.002496 0.071137
C  -0.000075 -0.029469 0.968361
H  0.000257 0.879201 1.582657
H  0.000424 -0.972864 1.527441
