program: Gaussian 09
title: 000061169
version: EM64L-G09RevD.01
frameworkgroup: C*V[C*(BrCCBr)]
method: RPBEPBE
basis: SDD
operation: Freq
keyword: #p
keyword: freq=noraman
keyword: PBEPBE/SDD
title: #p freq=noraman PBEPBE/SDD
converged: NO NO NO NO
title: Mulliken charges:
elementType: Br Br C C
charge: 0.122120 0.122121 -0.122120 -0.122121
chargesum: 0.00000
title: Mulliken charges with hydrogens summed into heavy atoms:
polarizability: 1.57258899e+01 2.38081529e-11 1.57258899e+01 -2.52803590e-10 -1.26797940e-09 1.01174400e+02
1716.lowfreq: -7.8836 -7.8836 0.0001 0.0002 0.0003 134.5551 134.5551 271.3968 276.6151
frequency: 134.5551 134.5551 271.3968 276.6126 276.6126 784.9612 2223.1778
redmass: 13.5123 13.5123 78.1096 12.0970 12.0970 13.5123 12.0189
irintensity: 5.3269 5.3269 0.0000 0.0000 0.0000 18.6220 0.0000
temp: 298.150 k
press: 1.00000 atm
elementType: 35 35 6 6
symmnumber: 1
zpe: 24534.6 jmol-1
zpe.correction: 0.009345 hartree
zpe.thermalcorrener: 0.014487 hartree
zpe.thermalcorrenthalpy: 0.015431 hartree
zpe.thermalcorrgfe: -0.019157 hartree
zpe.sumelectzpe: -102.735356 hartree
zpe.sumelectthermal: -102.730214 hartree
zpe.sumelectthermalent: -102.729270 hartree
zpe.sumelectthermalfe: -102.763857 hartree
dipole: 0.0000 0.0000 0.0000
dipole: 0.0000
quadrupole: -41.5170 -41.5170 -31.6462
quadrupole: 0.0000 0.0000 0.0000
quadrupole: -3.2903 -3.2903 6.5805 0.0000 0.0000 0.0000
hfenergy: -102.7447008 hartree
pointgroup: C*V [C*(Br1C1C1Br1)]
dipole: -0.0000041 0. 0. debye
dipolederiv: -0.3154074 0.0000081 -0.000008 0.0000081 0.1686944 0. -0.000008 0. 0.1686944 -0.3154138 0.0000081 -0.000008 0.0000081 0.1686956 0. -0.000008 0. 0.1686956 0.3154022 -0.0000081 0.000008 -0.0000081 -0.168695 0. 0.000008 0. -0.168695 0.315419 -0.0000081 0.000008 -0.0000081 -0.1686951 0. 0.000008 0. -0.1686951 unknown
polarizability: 101.1744004|-0.0014319|15.7258899|0.0014162|0.|15.7258899 unknown
InChI: InChI=1S/C2Br2/c3-1-2-4
charge 0 multiplicity 1
4 atoms
Br 2.454634 -0.00019568 0.00005758
Br -2.45458 -0.00011342 -0.00002378
C  0.61514399 -0.00016486 0.0000271
C  -0.61509801 -0.00014424 0.00000671
