program: Gaussian 09
title: 000073094
version: EM64L-G09RevD.01
frameworkgroup: C1[X(C14H21ClN2O3S)]
method: RPBEPBE
basis: SDD
operation: Freq
keyword: #p
keyword: freq=noraman
keyword: PBEPBE/SDD
title: #p freq=noraman PBEPBE/SDD
converged: YES YES NO NO
title: Mulliken charges:
elementType: Cl S O O O N N C C C C C C C C C C C C C C H H H H H H H H H H H H H H H H H H H H H
charge: -0.023739 0.934816 -0.535682 -0.506494 -0.209560 -0.489112 -0.571305 -0.251316 -0.380983 -0.391444 -0.346190 0.311574 -0.399614 -0.080517 -0.725015 -0.213870 -0.266417 0.453247 -0.363232 -0.370305 -0.797099 0.293989 0.247059 0.201238 0.227109 0.206584 0.179917 0.221235 0.320060 0.207614 0.183546 0.270919 0.329092 0.300321 0.294238 0.275076 0.259694 0.248659 0.247199 0.245791 0.230168 0.232746
chargesum: 0.00000
title: Mulliken charges with hydrogens summed into heavy atoms:
elementType: Cl S O O O N N C C C C C C C C C C C C C C
charge: -0.023739 0.934816 -0.535682 -0.506494 -0.209560 -0.169053 -0.036534 0.042673 0.067315 0.042249 0.054963 0.311574 -0.008453 -0.080517 -0.125003 0.086450 0.027822 0.453247 -0.114573 -0.123106 -0.088393
polarizability: 2.50649600e+02 3.25850507e+01 1.87989586e+02 1.05088635e+01 -5.31554767e-01 2.03962690e+02
1716.lowfreq: -8.0524 0.0015 0.0017 0.0022 2.2559 7.0089 18.1311 22.9747 24.3617
frequency: 18.1285 22.8237 24.1385 28.3849 33.7362 44.9290 52.4441 70.6927 83.8087 94.2120 112.9344 126.3903 132.6134 135.1020 153.1906 163.7430 172.7962 214.1775 225.2000 226.6640 234.8112 280.6430 296.6723 299.1518 326.1338 354.6531 368.7767 395.2797 403.9419 407.5935 457.9439 468.1385 486.6328 517.6061 588.7365 596.7701 612.1625 621.1498 664.7329 703.3675 713.3051 737.4785 775.3954 780.6904 792.8201 808.3474 826.4016 849.2399 867.8806 887.4179 912.3661 934.3579 946.7944 962.1910 968.8740 983.6083 990.2590 993.9837 1030.3097 1047.9257 1049.5513 1052.1805 1070.4030 1078.0681 1082.1742 1112.5825 1123.8451 1138.3925 1156.8148 1190.0985 1194.5999 1218.5337 1232.9752 1253.0819 1265.7453 1280.5077 1290.1624 1292.8473 1302.0748 1307.2915 1331.0818 1363.4730 1380.8725 1388.7621 1389.3071 1392.3823 1399.5976 1409.5304 1449.7262 1464.5255 1470.1194 1473.6883 1474.9643 1479.8760 1493.0393 1592.7832 1593.9107 1634.5524 1639.2903 2867.7342 2958.4856 2973.5938 2981.7837 2981.9600 3010.7651 3022.2828 3030.9590 3035.7233 3044.0673 3062.3718 3064.7051 3094.1762 3107.7687 3138.7592 3140.2223 3160.4424 3163.6619 3293.9260 3454.5762 3582.0533
redmass: 2.3739 1.4678 5.7918 6.0437 4.8520 5.4810 1.7308 4.4774 4.1199 3.3781 3.8858 4.9009 3.1275 3.0111 5.8254 5.0036 4.8303 8.6749 4.5389 3.9686 1.2673 4.7723 5.0193 4.7095 3.8044 4.3724 3.5905 5.6065 4.4624 3.3041 4.9118 4.6327 2.8529 3.7457 5.5985 1.4845 2.7529 6.9126 3.3279 3.3327 5.7580 1.1435 4.7980 1.3554 3.6411 4.1412 1.3615 1.2588 1.8946 2.1072 1.9938 2.5131 4.7829 1.3067 1.8909 1.3972 1.7567 3.0585 2.8490 3.6886 1.6277 2.4440 2.0523 2.3149 2.5985 2.3953 1.3029 1.2590 1.4550 1.1366 1.2902 3.0906 1.4165 1.2184 1.2480 1.3430 1.0649 1.3270 1.2580 1.1566 1.3436 1.4979 5.7180 1.2288 1.4418 2.9005 1.2255 1.0907 1.0814 1.0697 1.0985 1.3871 1.5218 1.0911 1.0902 6.4103 6.3099 9.1856 1.0950 1.0714 1.0645 1.0623 1.0593 1.0401 1.0856 1.0972 1.0680 1.0739 1.0994 1.1021 1.0949 1.1001 1.1061 1.0889 1.0891 1.0961 1.0973 1.0725 1.0449 1.0975
irintensity: 1.4032 0.0950 1.1502 0.7457 0.9172 1.4576 4.5971 1.6154 2.8793 9.9032 2.1261 0.8800 3.8938 0.3258 2.7224 2.9032 0.3021 16.2287 1.7577 7.6050 53.6679 6.0892 11.1273 1.7975 4.7539 6.8979 4.6561 24.9504 7.2511 6.9224 19.4453 39.4378 9.8459 98.5956 18.9501 177.2576 69.9659 0.4723 2.6287 1.6732 64.7305 7.4978 17.6412 0.7501 84.1100 29.6903 30.7776 3.3092 0.6481 8.6326 11.5614 16.9338 107.9730 1.8265 7.7030 0.7910 6.4124 1.7073 7.9113 2.2360 27.2603 20.0806 31.1674 3.9197 8.7261 31.8064 4.6775 1.2771 7.5844 22.3947 14.1588 5.4047 19.7850 5.4283 5.3685 17.8712 3.8858 14.2261 2.5569 1.5131 0.3555 9.0628 1.6013 14.2897 23.3736 12.6574 17.9133 43.5389 7.2740 2.0909 18.6397 19.9018 20.6487 4.5737 5.3461 3.8267 9.3645 57.7657 40.3352 103.2718 16.8698 2.2429 74.1189 7.4065 31.5037 3.6293 6.8393 9.7494 18.9157 70.7436 17.1288 14.4852 4.3276 12.4583 4.8527 0.4891 14.7971 20.5625 1.2385 0.3280
temp: 298.150 k
press: 1.00000 atm
elementType: 17 16 8 8 8 7 7 6 6 6 6 6 6 6 6 6 6 6 6 6 6 1 1 1 1 1 1 1 1 1 1 1 1 1 1 1 1 1 1 1 1 1
symmnumber: 1
zpe: 871563.8 jmol-1
zpe.correction: 0.331961 hartree
zpe.thermalcorrener: 0.356707 hartree
zpe.thermalcorrenthalpy: 0.357651 hartree
zpe.thermalcorrgfe: 0.272710 hartree
zpe.sumelectzpe: -1737.573139 hartree
zpe.sumelectthermal: -1737.548394 hartree
zpe.sumelectthermalent: -1737.547449 hartree
zpe.sumelectthermalfe: -1737.632390 hartree
dipole: -0.5352 -3.7993 -2.9642
dipole: 4.8485
quadrupole: -112.1880 -144.9018 -152.2317
quadrupole: 13.4498 10.7791 10.6550
quadrupole: 24.2525 -8.4613 -15.7912 13.4498 10.7791 10.6550
hfenergy: -1737.9051001 hartree
pointgroup: C01 [X(C14H21Cl1N2O3S1)]
dipole: 0.1348045 0.7064015 1.7667819 debye
polarizability: 242.2162111|-5.1004143|203.7152191|40.0050309|-2.2817583|196.6704463 unknown
InChI: InChI=1S/C14H21ClN2O3S/c1-11-5-7-12(8-6-11)21(19,20)17-13(14(18)10-15)4-2-3-9-16/h5-8,13,17H,2-4,9-10,16H2,1H3
charge 0 multiplicity 1
42 atoms
Cl -1.572738 3.235809 -3.838773
S  1.121365 -1.324245 -1.626155
O  1.12113 -0.416533 -2.994007
O  1.354941 -2.921255 -1.738229
O  -0.660477 1.7578 -1.291725
N  -0.566019 -1.024805 -0.776321
N  -6.38768 0.691276 2.260284
C  -1.511969 -0.475481 -1.781711
C  -2.965009 -0.574586 -1.211786
C  -3.211515 0.176729 0.114404
C  -4.688518 0.074812 0.557558
C  -1.166732 0.991943 -2.149355
C  -4.962314 0.802465 1.889894
C  2.338949 -0.618692 -0.372771
C  -1.492275 1.391815 -3.57726
C  2.477465 0.776482 -0.274071
C  3.082741 -1.534317 0.386974
C  4.196659 0.389916 1.457125
C  3.416955 1.269443 0.657436
C  4.015529 -1.010958 1.309514
C  5.223613 0.939953 2.42927
H  -1.461306 -1.105003 -2.688307
H  -3.175157 -1.651314 -1.074549
H  -3.665848 -0.202602 -1.987606
H  -2.927279 1.242346 0.013697
H  -2.567448 -0.254295 0.906883
H  -5.339071 0.507259 -0.233102
H  -4.989675 -0.984135 0.67235
H  -0.360697 -0.291489 -0.061194
H  -4.364638 0.323174 2.689445
H  -4.595596 1.855743 1.803157
H  -2.457705 0.974942 -3.907011
H  -0.683586 1.006582 -4.222226
H  1.88201 1.454482 -0.894576
H  2.938259 -2.611248 0.251766
H  -6.600715 0.970621 3.222487
H  -7.024944 1.129042 1.586796
H  3.544698 2.35276 0.762019
H  4.609465 -1.7002 1.920157
H  6.178294 1.152911 1.910655
H  5.441448 0.223474 3.239502
H  4.88329 1.885081 2.887063
