program: Gaussian 09
title: 000073015
version: EM64L-G09RevD.01
frameworkgroup: C1[X(C9H12N2O4)]
method: RPBEPBE
basis: SDD
operation: Freq
keyword: #p
keyword: freq=noraman
keyword: PBEPBE/SDD
title: #p freq=noraman PBEPBE/SDD
converged: NO YES NO NO
title: Mulliken charges:
elementType: O O O O N N C C C C C C C C C H H H H H H H H H H H H
charge: -0.309419 -0.208636 -0.233611 -0.228718 -0.404702 -0.391137 -0.372621 -0.344553 -0.256017 -0.683409 0.228106 0.225097 -0.326620 0.136978 0.181129 0.212609 0.212331 0.199884 0.200373 0.236029 0.235943 0.213632 0.213643 0.223337 0.380355 0.292245 0.367749
chargesum: 0.00000
title: Mulliken charges with hydrogens summed into heavy atoms:
elementType: O O O O N N C C C C C C C C C
charge: -0.309419 -0.208636 -0.233611 -0.228718 -0.024346 -0.023387 0.052320 0.055705 0.215956 -0.032797 0.228106 0.225097 -0.034375 0.136978 0.181129
polarizability: 1.83102695e+02 -1.04041509e+01 1.35241700e+02 1.54439359e-01 -8.69498029e-02 6.91073490e+01
1716.lowfreq: -33.2146 -6.8057 -5.4575 0.0005 0.0006 0.0011 10.9055 39.9990 47.1140
frequency: -27.1667 39.4916 47.0997 64.4057 92.9617 115.5336 143.0791 162.6004 183.2623 197.5180 225.0392 229.8550 245.9427 336.9800 384.0726 412.5315 450.2317 499.3663 509.8600 552.2914 589.3230 668.3026 687.3642 736.8469 738.4068 740.3409 742.8909 778.4738 792.8748 860.5594 874.8211 907.7892 926.7569 929.4825 973.0882 989.1411 1039.1498 1071.1177 1080.3125 1124.6201 1147.5592 1196.0185 1205.5170 1212.6598 1270.9849 1271.5537 1288.0972 1291.6044 1341.5186 1345.8760 1367.5094 1372.7359 1388.8480 1461.5415 1467.8641 1471.4801 1476.8817 1479.5190 1489.3488 1602.1885 1639.2639 1654.5461 1678.1349 2971.7900 2978.2061 2992.6299 3006.8761 3016.2569 3048.8120 3073.6823 3081.4259 3083.7021 3216.2346 3527.3785 3540.8808
redmass: 2.4544 2.7155 5.0209 5.3418 2.2305 4.5793 4.5563 7.3061 5.2104 3.8448 5.3070 1.1697 5.6356 10.5518 7.0329 3.3488 6.6035 7.5714 7.6234 10.1436 5.1084 2.3963 1.9617 1.8413 1.0861 9.7074 3.3552 2.0249 1.1403 6.3618 1.5345 1.9451 5.5930 1.1693 3.3521 6.3918 3.3102 2.7273 2.2637 2.6649 1.4911 8.3411 2.6549 1.3351 1.2776 1.1848 1.0765 1.7644 1.9413 1.7762 1.6939 1.6168 1.2144 3.7320 1.0818 1.0689 1.0424 1.0634 1.0909 7.9243 11.6817 7.3255 5.9658 1.0591 1.0362 1.0596 1.0565 1.1007 1.1039 1.1027 1.0995 1.1071 1.0943 1.0771 1.0779
irintensity: 0.4825 0.0026 0.1078 0.6414 0.1888 0.5820 0.5626 7.6207 0.8580 2.2319 4.5387 0.3590 6.9912 0.7862 35.7279 5.9597 0.7688 6.0612 12.2412 5.6766 3.1117 2.4712 28.8682 46.6305 7.0321 7.3308 1.4503 175.6657 0.5213 9.0073 41.7600 5.1240 14.5688 0.6154 34.1600 116.1907 31.6219 101.7281 1.4127 3.4275 2.5609 169.6115 322.2952 0.0991 0.9448 0.2091 0.2347 137.9704 44.6458 24.0441 10.4022 11.2125 8.5860 111.6966 0.5603 0.9366 14.0606 4.2551 18.7192 110.9090 204.5975 263.1900 620.4658 24.8994 28.9122 19.8388 28.2584 6.1692 3.9025 19.4109 44.9549 92.2785 8.0572 69.9501 137.6233
temp: 298.150 k
press: 1.00000 atm
elementType: 8 8 8 8 7 7 6 6 6 6 6 6 6 6 6 1 1 1 1 1 1 1 1 1 1 1 1
symmnumber: 1
zpe: 549103.3 jmol-1
zpe.correction: 0.209142 hartree
zpe.thermalcorrener: 0.223414 hartree
zpe.thermalcorrenthalpy: 0.224358 hartree
zpe.thermalcorrgfe: 0.166556 hartree
zpe.sumelectzpe: -759.469447 hartree
zpe.sumelectthermal: -759.455175 hartree
zpe.sumelectthermalent: -759.454231 hartree
zpe.sumelectthermalfe: -759.512033 hartree
dipole: -6.1830 0.3716 -0.0091
dipole: 6.1942
quadrupole: -92.6300 -105.7269 -86.6528
quadrupole: 3.6800 -0.0163 0.0258
quadrupole: 2.3732 -10.7237 8.3504 3.6800 -0.0163 0.0258
hfenergy: -759.6785895 hartree
pointgroup: C01 [X(C9H12N2O4)]
dipole: 2.4316485 -0.1612519 -0.0014072 debye
polarizability: 182.9724076|-10.6993227|135.3721955|-0.0525107|0.0669608|69.1071415 unknown
InChI: InChI=1S/C9H12N2O4/c1-2-3-4-15-8(13)6-5-7(12)11-9(14)10-6/h5,10-11H,2-4H2,1H3
charge 0 multiplicity 1
27 atoms
O  1.326453 0.249384 -0.003253
O  0.461958 2.424912 -0.003016
O  -2.187124 -2.939451 -0.006915
O  -4.63518 1.062805 0.004314
N  -1.031005 -0.900437 -0.004539
N  -3.380695 -0.911932 -0.001652
C  3.677732 -0.40062 0.002853
C  5.156021 0.060547 -0.000715
C  2.723717 0.792052 -0.004997
C  6.13785 -1.13065 0.019204
C  -1.034068 0.493274 -0.002118
C  0.295019 1.18606 -0.002698
C  -2.208322 1.210556 0.000664
C  -2.202952 -1.682125 -0.00459
C  -3.497618 0.513497 0.001029
H  3.482941 -1.034245 -0.883503
H  3.483337 -1.021557 0.898233
H  5.343573 0.709568 0.878438
H  5.34729 0.683661 -0.897548
H  2.839715 1.433376 0.88794
H  2.841175 1.423421 -0.904812
H  5.99019 -1.751356 0.922438
H  5.992088 -1.780489 -0.863667
H  7.186772 -0.78415 0.014549
H  -0.134476 -1.394465 -0.006273
H  -2.193207 2.300733 0.002601
H  -4.257587 -1.442967 -0.001367
