program: Gaussian 09
title: 000061157
version: EM64L-G09RevD.01
frameworkgroup: C1[X(C3H10N2O)]
method: RPBEPBE
basis: SDD
operation: Freq
keyword: #p
keyword: freq=noraman
keyword: PBEPBE/SDD
title: #p freq=noraman PBEPBE/SDD
converged: YES YES NO NO
title: Mulliken charges:
elementType: O N N C C C H H H H H H H H H H
charge: -0.467994 -0.543670 -0.589652 -0.010635 -0.408942 -0.415471 0.171501 0.236429 0.210134 0.220137 0.178694 0.255055 0.281030 0.286219 0.266322 0.330845
chargesum: 0.00000
title: Mulliken charges with hydrogens summed into heavy atoms:
elementType: O N N C C C
charge: -0.137150 -0.007585 -0.037111 0.160866 0.037621 -0.016641
polarizability: 5.60863967e+01 -1.12972061e+00 5.24881687e+01 9.15143180e-01 9.99769945e-01 4.45311232e+01
1716.lowfreq: -16.6054 -5.4005 0.0004 0.0004 0.0008 8.0128 98.7159 118.7377 180.5589
frequency: 98.6785 118.6945 180.5555 217.8805 247.9965 282.9717 295.5168 404.8230 457.1826 500.6327 569.1529 655.5480 804.5674 860.0908 939.0990 993.2130 1039.9954 1087.5641 1104.1461 1128.4667 1161.3937 1236.1499 1266.0499 1296.2839 1329.4116 1338.8103 1362.3352 1381.9996 1449.1140 1471.9934 1640.3235 1643.9261 2842.1515 2911.8153 2994.7206 3033.3197 3075.7998 3451.2589 3485.7214 3552.9228 3577.6914 3614.9575
redmass: 2.3187 2.7305 1.1248 2.4799 2.2348 1.1122 1.2539 2.3483 3.0107 2.2957 1.4394 1.5241 2.1262 1.5271 1.5417 2.0045 2.0662 2.6313 2.8678 1.7062 1.6016 1.2659 1.2016 1.2448 1.2739 1.1706 1.5090 1.4840 1.0904 1.0880 1.0953 1.0880 1.0719 1.0835 1.0644 1.0881 1.0997 1.0444 1.0451 1.0660 1.0972 1.0987
irintensity: 2.5695 2.7154 23.2373 5.2843 12.1153 44.7639 179.2197 44.1164 9.1957 54.3102 172.1437 316.6699 28.6214 10.0832 11.7740 37.9446 54.5508 29.0180 7.3714 8.1052 3.1041 19.5973 15.0034 5.6076 0.6815 6.2444 0.3183 11.3755 9.5401 4.6545 43.2813 35.3476 148.9176 63.7549 38.5978 39.9671 21.0042 1.5894 0.6341 2.7373 1.7049 2.4466
temp: 298.150 k
press: 1.00000 atm
elementType: 8 7 7 6 6 6 1 1 1 1 1 1 1 1 1 1
symmnumber: 1
zpe: 365488.6 jmol-1
zpe.correction: 0.139207 hartree
zpe.thermalcorrener: 0.147494 hartree
zpe.thermalcorrenthalpy: 0.148439 hartree
zpe.thermalcorrgfe: 0.107294 hartree
zpe.sumelectzpe: -304.489823 hartree
zpe.sumelectthermal: -304.481535 hartree
zpe.sumelectthermalent: -304.480591 hartree
zpe.sumelectthermalfe: -304.521736 hartree
dipole: 3.3921 1.1663 -2.1199
dipole: 4.1666
quadrupole: -36.7434 -38.8347 -35.1567
quadrupole: -1.5787 2.9802 -0.0278
quadrupole: 0.1682 -1.9231 1.7550 -1.5787 2.9802 -0.0278
hfenergy: -304.6290298 hartree
pointgroup: C01 [X(C3H10N2O1)]
dipole: 1.3188308 0.4769392 -0.8487774 debye
dipolederiv: -0.4994282 0.254722 -0.1653566 0.2417892 -0.6985708 -0.1171396 -0.1731519 -0.1196202 -0.4434201 -0.847062 -0.2801707 0.0442723 -0.3005734 -0.4481255 0.1591322 0.1118292 0.2032216 -0.352023 -0.6158993 -0.0279456 0.0825647 -0.047659 -0.8066773 -0.0201818 0.0858341 -0.0729024 -0.2134742 0.1648657 -0.1537074 0.0064878 -0.2249409 0.5537378 0.0795637 0.0664323 0.1240649 0.3644927 0.5130353 0.0930882 0.0716225 0.1659453 0.1801824 -0.0368954 0.0995358 -0.0018246 0.2681178 0.2635013 -0.0927115 -0.1100111 -0.1292807 0.5244889 -0.0054306 -0.0902993 0.0416245 0.1735427 0.0010225 0.039805 0.0050367 0.0127122 -0.0436196 -0.0396854 0.0148366 -0.0655558 -0.2617412 0.0490315 0.0669213 -0.012586 0.0734377 -0.0778645 -0.0096011 0.0126647 -0.0415447 0.0931107 0.0150591 -0.0326138 -0.0264357 -0.0453358 0.0756436 -0.0681064 -0.0378978 -0.0317585 -0.1669329 0.0794954 0.0179559 0.015731 0.0407082 0.0448702 0.0205669 -0.0273369 -0.0183569 -0.15664 -0.0956629 -0.0817873 0.0318144 -0.0759653 -0.3417085 0.0201903 0.0331284 0.0920719 0.0364942 0.1994751 0.0898628 0.0158787 0.1079752 0.2779196 -0.0333176 -0.0948957 -0.1314382 -0.0184467 0.255769 0.0647567 -0.0776498 0.1549555 0.0796592 -0.0334889 -0.1465311 -0.0188888 0.2317434 0.0605553 0.1409759 -0.0771281 0.0607968 0.2823652 -0.0516457 -0.0567432 -0.0472732 0.154585 0.2475274 0.1009691 0.0512955 0.0806896 0.2370038 0.0612397 0.0540096 0.0021449 0.0215929 0.2087147 -0.2001205 0.1444636 -0.1152546 0.1606955 0.0747997 0.1485853 0.0860354 0.2689987 unknown
polarizability: 56.0954844|-1.1772054|52.4198669|0.5844771|1.3491521|44.5903372 unknown
InChI: InChI=1S/C3H10N2O/c4-1-3(6)2-5/h3,6H,1-2,4-5H2
charge 0 multiplicity 1
16 atoms
O  -0.613291 1.688491 0.055515
N  -2.223166 -0.764841 -0.127019
N  2.201066 -0.804905 -0.324885
C  0.030809 0.405606 -0.3003
C  -0.838281 -0.682686 0.364822
C  1.500776 0.385834 0.182826
H  0.008334 0.267336 -1.407523
H  -0.33398 -1.65483 0.226005
H  -0.860775 -0.469146 1.451445
H  1.502691 0.354393 1.288776
H  1.984917 1.353723 -0.108957
H  -2.312229 -1.182749 -1.058862
H  -2.711314 0.135068 -0.066354
H  3.002329 -1.115209 0.227619
H  2.389006 -0.803683 -1.330491
H  -0.104292 2.436099 -0.349319
