program: Gaussian 09
title: 000061140
version: EM64L-G09RevD.01
frameworkgroup: C1[X(C5H9ClO2)]
method: RPBEPBE
basis: SDD
operation: Freq
keyword: #p
keyword: freq=noraman
keyword: PBEPBE/SDD
title: #p freq=noraman PBEPBE/SDD
converged: NO YES NO NO
title: Mulliken charges:
elementType: Cl O O C C C C C H H H H H H H H H
charge: -0.039134 -0.188797 -0.155469 -0.364966 -0.349067 -0.280948 -0.680646 0.095867 0.217884 0.218009 0.199631 0.199487 0.238827 0.238732 0.214207 0.214214 0.222170
chargesum: 0.00000
title: Mulliken charges with hydrogens summed into heavy atoms:
elementType: Cl O O C C C C C
charge: -0.039134 -0.188797 -0.155469 0.070927 0.050051 0.196611 -0.030055 0.095867
polarizability: 9.89837135e+01 7.19806018e+00 6.84999453e+01 -2.22667020e-02 -1.29081976e-02 4.76795775e+01
1716.lowfreq: -5.0116 -0.0007 -0.0004 0.0016 6.0078 9.3701 39.3159 59.7293 83.3030
frequency: 37.8369 59.6855 83.2910 114.0623 161.4207 216.5799 233.1111 247.4636 401.9543 422.0842 444.1809 615.6423 743.4569 765.2196 800.1244 858.6212 906.4166 933.0913 1039.6215 1060.9660 1087.6789 1125.7925 1140.8267 1210.9476 1273.0961 1274.8846 1288.6777 1343.7539 1369.1040 1396.2275 1467.2373 1472.2792 1479.0342 1479.0924 1490.1135 1695.4615 2974.1340 2981.0339 3000.9220 3012.9102 3018.8879 3057.1433 3078.0591 3082.1008 3092.7980
redmass: 4.1130 1.9903 5.3195 2.1703 3.1652 4.3008 1.1463 6.4046 3.6513 9.7547 5.4953 11.7406 1.0708 9.7680 1.1374 8.6262 1.8185 1.1654 3.3596 5.8460 2.6575 2.6494 1.4161 1.3734 1.2836 1.1714 1.0745 1.4059 1.4963 1.2118 1.0880 1.0694 1.0603 1.0414 1.0912 11.9210 1.0588 1.0365 1.0601 1.0563 1.1009 1.1038 1.1018 1.0995 1.1089
irintensity: 1.3419 0.0140 0.4699 0.0391 3.3519 1.7831 0.1449 14.1380 4.2108 9.9556 22.0375 10.5067 9.9481 94.4603 0.2670 6.3493 0.0844 0.5696 43.6261 534.1062 110.1834 3.3690 2.8357 0.0181 3.4513 0.1538 0.1294 1.9095 18.1024 7.0321 1.4929 0.5817 5.9948 13.8280 21.8871 343.5012 29.9570 28.4250 13.2128 30.8437 8.8400 2.5764 38.8115 44.2689 71.0567
temp: 298.150 k
press: 1.00000 atm
elementType: 17 8 8 6 6 6 6 6 1 1 1 1 1 1 1 1 1
symmnumber: 1
zpe: 353119.8 jmol-1
zpe.correction: 0.134496 hartree
zpe.thermalcorrener: 0.144320 hartree
zpe.thermalcorrenthalpy: 0.145264 hartree
zpe.thermalcorrgfe: 0.097628 hartree
zpe.sumelectzpe: -805.785708 hartree
zpe.sumelectthermal: -805.775884 hartree
zpe.sumelectthermalent: -805.774940 hartree
zpe.sumelectthermalfe: -805.822576 hartree
dipole: 4.1911 -0.0196 0.0000
dipole: 4.1912
quadrupole: -58.6680 -59.5511 -53.5913
quadrupole: 2.9688 0.0072 -0.0050
quadrupole: -1.3979 -2.2809 3.6788 2.9688 0.0072 -0.0050
hfenergy: -805.9202042 hartree
pointgroup: C01 [X(C5H9Cl1O2)]
dipole: 1.6450946 -0.112386 -0.0041292 debye
dipolederiv: -0.6794895 0.3750561 -0.0005073 0.4750944 -0.5592782 0.0013821 -0.0028117 0.0029392 -0.0904783 -1.9100448 0.0743489 0.0043821 -0.1578662 -0.4852752 0.0013908 0.0084733 0.0010808 -0.2391056 -0.6879555 -0.0115175 0.0015848 -0.174673 -1.1081233 0.0063218 0.0014125 0.0018811 -0.2543837 -0.1721363 0.0139353 0.000779 0.066946 0.0244894 0.0001177 0.0004673 0.0005679 0.1430898 0.065147 -0.0329005 0.0003866 -0.1590091 0.1036156 0.0006075 0.0006144 0.0000325 0.1826302 0.9787574 -0.1089642 -0.001717 -0.2727266 0.2892171 0.0013669 -0.0006621 0.0005818 0.3678008 -0.0530726 -0.0321008 0.0004345 0.0283263 0.046806 -0.0000225 0.0002896 0.0001633 0.0925572 2.3275449 -0.3362086 -0.0037517 0.0711512 1.7987216 -0.0098612 -0.0058512 -0.0061829 0.2436505 0.0647604 0.0015706 -0.0044852 -0.0144622 -0.0081214 -0.0991321 0.0097778 -0.1146704 -0.059025 0.0645651 0.0023731 0.003688 -0.0138773 -0.0064162 0.0988012 -0.0103661 0.1142255 -0.0606425 0.0335217 -0.0219265 -0.0265759 0.0049193 -0.0411681 -0.1201432 -0.0059422 -0.1481334 -0.083155 0.0337344 -0.0214757 0.0262701 0.0051799 -0.0402267 0.1200076 0.0056215 0.1481134 -0.0842474 -0.0308013 0.0019977 -0.0265177 0.0577696 -0.002853 -0.0717622 -0.0192801 -0.0913065 -0.0485646 -0.0299391 0.0029502 0.0262641 0.058576 -0.0017034 0.0710587 0.0184422 0.0909867 -0.050114 0.0795465 -0.0006733 -0.0253945 -0.0475431 -0.008938 0.1184889 0.0208074 0.1340722 -0.0825952 0.0794724 -0.0012009 0.0246583 -0.0480859 -0.0094901 -0.1184322 -0.0214077 -0.134238 -0.0820473 -0.1636108 0.0947361 0.0005016 0.1202805 0.008744 -0.0001897 0.000415 -0.0001133 0.1046299 unknown
polarizability: 97.7764852|-9.3357687|69.7064798|-0.0760768|-0.0954859|47.6802713 unknown
InChI: InChI=1S/C5H9ClO2/c1-2-3-4-8-5(6)7/h2-4H2,1H3
charge 0 multiplicity 1
17 atoms
Cl -3.416321 1.206299 0.006639
O  -0.905231 0.472436 0.00536
O  -2.403967 -1.332599 0.017352
C  1.53017 0.397666 -0.003697
C  2.816107 -0.465711 -0.004294
C  0.278872 -0.473606 0.004102
C  4.094211 0.39975 -0.008028
C  -2.128905 -0.131201 0.013808
H  1.52298 1.058573 0.883331
H  1.517318 1.051112 -0.896169
H  2.817069 -1.130387 -0.891502
H  2.820159 -1.127528 0.885074
H  0.197309 -1.112808 -0.893582
H  0.204443 -1.106411 0.90693
H  4.130823 1.049683 -0.901824
H  4.134718 1.051562 0.884224
H  5.002344 -0.22923 -0.009423
