program: Gaussian 09
title: 000061137
version: EM64L-G09RevD.01
frameworkgroup: C1[X(C9H18O2)]
method: RPBEPBE
basis: SDD
operation: Freq
keyword: #pfreq=noraman
keyword: PBEPBE/SDD
title: #p freq=noraman PBEPBE/SDD
converged: YES YES NO NO
title: Mulliken charges:
elementType: O O C C C C C C C C C H H H H H H H H H H H H H H H H H H
charge: -0.266099 -0.240886 -0.342387 -0.368529 -0.510477 -0.341678 -0.345444 -0.263134 0.243915 -0.692402 -0.686824 0.209175 0.210446 0.206693 0.206723 0.239879 0.240223 0.191916 0.191853 0.196720 0.196718 0.220622 0.220606 0.212166 0.212321 0.215715 0.211840 0.211805 0.218522
chargesum: 0.00000
title: Mulliken charges with hydrogens summed into heavy atoms:
elementType: O O C C C C C C C C C
charge: -0.266099 -0.240886 0.077234 0.044888 -0.030375 0.042092 0.047995 0.178094 0.243915 -0.052201 -0.044657
polarizability: 1.41150260e+02 -1.49345636e+00 9.50833332e+01 3.85192940e-02 4.52270892e-02 8.15676078e+01
1716.lowfreq: -14.3200 0.0001 0.0006 0.0008 4.4351 9.1232 14.3805 35.6060 52.6228
frequency: -13.6447 34.8658 52.4128 56.3471 79.0561 111.6400 114.2541 128.1268 176.1233 227.4415 228.7254 229.2928 234.8332 297.4998 377.8930 411.6633 504.1403 545.4495 672.8648 723.9108 739.5976 790.6873 796.7352 850.7628 901.4224 914.3637 920.3380 930.2130 931.4858 1034.8827 1042.6527 1080.7942 1084.5442 1100.1235 1105.2734 1124.9087 1137.7219 1147.3683 1204.3401 1212.0315 1261.7618 1269.8339 1271.1190 1274.6480 1286.3892 1289.7938 1332.0924 1344.9598 1363.3590 1375.5949 1390.9664 1394.4926 1439.5236 1467.2121 1469.1315 1472.9992 1475.5338 1476.4477 1478.9064 1481.4100 1487.7945 1490.5059 1638.6239 2963.0580 2969.5128 2974.2783 2976.7867 2984.1373 2990.8117 2995.4548 3000.0409 3005.8484 3012.5702 3027.9745 3042.9334 3058.0223 3069.0014 3072.5264 3073.7692 3076.9924 3077.6842
redmass: 2.1370 4.5756 1.7607 3.8132 2.3476 1.9665 2.1128 3.6354 2.5469 3.8067 1.4236 2.2657 1.1548 4.5068 3.5877 3.0029 3.8101 2.6307 6.0599 1.1065 1.0706 1.2675 1.1440 5.4074 1.7458 1.9608 1.2891 7.2514 1.1630 3.3723 3.3737 2.2182 2.0964 2.8444 1.5038 2.6058 3.1082 1.4874 1.4582 1.3474 1.4068 1.1549 1.3112 1.1771 1.0842 1.0589 1.4964 1.4718 1.6557 1.6169 1.2239 1.2202 1.0864 1.0715 1.0785 1.0669 1.0662 1.0421 1.0416 1.0651 1.0803 1.0903 9.7875 1.0591 1.0587 1.0362 1.0367 1.0610 1.0599 1.0598 1.0568 1.0999 1.1003 1.0990 1.1037 1.1027 1.1046 1.1010 1.0994 1.0994 1.1040
irintensity: 0.0014 0.1770 0.6153 0.3718 0.3726 0.0877 0.0106 1.0831 7.5983 4.7007 0.1538 0.3884 0.3371 8.2270 0.5478 9.9320 1.4996 1.3453 4.4739 12.9382 9.1142 0.0588 0.5453 6.9470 19.3283 2.3724 4.7902 44.8174 0.3902 6.4318 42.2366 42.6916 1.5790 111.6270 0.3846 8.8627 249.8929 2.2791 0.3231 0.0044 59.8340 0.1570 10.7938 0.3108 0.0805 0.1557 38.3050 4.2692 6.2090 1.8394 13.5885 10.0588 23.8296 1.1531 0.3356 0.2325 3.9031 12.6634 13.0834 5.3384 16.9915 21.5363 171.7867 33.5499 27.8466 35.6241 29.8654 3.3297 14.4210 31.6126 55.5771 10.4811 6.9866 0.0104 1.4936 12.7689 0.0198 92.8621 51.1760 49.3075 140.7089
temp: 298.150 k
press: 1.00000 atm
elementType: 8 8 6 6 6 6 6 6 6 6 6 1 1 1 1 1 1 1 1 1 1 1 1 1 1 1 1 1 1
symmnumber: 1
zpe: 669079.1 jmol-1
zpe.correction: 0.254839 hartree
zpe.thermalcorrener: 0.268442 hartree
zpe.thermalcorrenthalpy: 0.269386 hartree
zpe.thermalcorrgfe: 0.213215 hartree
zpe.sumelectzpe: -503.298426 hartree
zpe.sumelectthermal: -503.284823 hartree
zpe.sumelectthermalent: -503.283879 hartree
zpe.sumelectthermalfe: -503.340050 hartree
dipole: 0.9407 -1.6617 -0.0027
dipole: 1.9095
quadrupole: -61.0469 -75.1196 -67.2498
quadrupole: 4.0157 0.0266 0.0135
quadrupole: 6.7585 -7.3141 0.5556 4.0157 0.0266 0.0135
hfenergy: -503.553265 hartree
pointgroup: C01 [X(C9H18O2)]
dipole: 0.3695624 0.6540538 -0.0012359 debye
polarizability: 141.1476918|1.5298344|95.0858761|-0.1102561|0.0047557|81.5676329 unknown
InChI: InChI=1S/C9H18O2/c1-3-5-7-9(10)11-8-6-4-2/h3-8H2,1-2H3
charge 0 multiplicity 1
29 atoms
O  0.673529 0.316587 0.002108
O  -0.579953 -1.648061 0.014372
C  -3.07583 -0.162008 -0.002797
C  3.102266 0.465939 -0.005474
C  -1.714559 0.559105 0.015258
C  -4.262726 0.826249 0.011078
C  4.456997 -0.281978 -0.006975
C  1.921305 -0.504583 -0.000005
C  -0.531822 -0.395968 0.010594
C  -5.630019 0.10975 -0.008196
C  5.661582 0.683174 -0.012982
H  -3.137311 -0.809379 -0.898709
H  -3.142971 -0.842137 0.867916
H  3.038384 1.124175 0.88233
H  3.033906 1.119787 -0.896182
H  -1.62419 1.210503 0.907193
H  -1.612205 1.236205 -0.855644
H  -4.188758 1.505103 -0.863418
H  -4.196004 1.47106 0.91155
H  4.510676 -0.947044 -0.892787
H  4.515439 -0.94179 0.882468
H  1.910923 -1.157066 -0.89327
H  1.916422 -1.153685 0.895786
H  -5.735361 -0.518175 -0.912806
H  -5.743445 -0.550774 0.871862
H  -6.466012 0.83287 0.001194
H  5.645026 1.332313 -0.908448
H  5.647827 1.339603 0.877213
H  6.619183 0.131624 -0.012231
