program: Gaussian 09
title: 000061121
version: EM64L-G09RevD.01
frameworkgroup: C1[X(C20H30N2O3)]
method: RPBEPBE
basis: SDD
operation: Freq
keyword: #p
keyword: freq=noraman
keyword: PBEPBE/SDD
title: #p freq=noraman PBEPBE/SDD
converged: YES YES NO NO
title: Mulliken charges:
elementType: O O O N N C C C C C C C C C C C C C C C C C C C C H H H H H H H H H H H H H H H H H H H H H H H H H H H H H H
charge: -0.264702 -0.247661 -0.246611 -0.060046 -0.092665 0.122978 -0.480655 -0.466705 -0.430341 -0.403886 -0.354013 0.423831 0.175869 -0.370307 -0.368195 -0.404041 -0.333699 -0.346001 -0.326158 -0.319684 -0.262222 -0.249389 -0.241655 -0.224982 -0.675904 0.210264 0.222793 0.223441 0.224871 0.215149 0.189191 0.206106 0.211352 0.179991 0.224694 0.187345 0.225458 0.254338 0.251581 0.212021 0.188271 0.189116 0.212793 0.213506 0.191051 0.192388 0.213027 0.225659 0.223971 0.228687 0.227505 0.229013 0.233577 0.227378 0.212309
chargesum: 0.00000
title: Mulliken charges with hydrogens summed into heavy atoms:
elementType: O O O N N C C C C C C C C C C C C C C C C C C C C
charge: -0.264702 -0.247661 -0.246611 -0.060046 -0.092665 0.122978 -0.047598 -0.018392 -0.026001 0.013572 0.050672 0.423831 0.175869 0.042497 -0.113858 -0.152460 0.066593 0.055907 0.078399 0.085732 -0.036562 -0.025418 -0.012968 0.231536 -0.002641
polarizability: 2.87284410e+02 2.22159403e+01 2.14979884e+02 1.28353599e+00 1.87307914e+00 2.03896541e+02
1716.lowfreq: -8.8785 -3.5741 -0.0007 -0.0006 0.0008 5.4004 8.4995 20.8655 29.2738
frequency: 1.7362 20.6996 29.1631 36.6137 44.8804 68.8134 73.9081 79.0146 85.5580 117.5525 121.1648 132.1658 145.5339 178.1460 196.0709 210.8822 236.1620 240.7417 257.9424 267.6371 297.1375 307.0218 315.3343 320.5932 344.0538 368.9538 384.1855 392.1482 404.6108 416.1761 444.2834 464.7214 471.5709 496.7048 525.2179 534.7318 576.7435 606.3592 617.7508 637.9270 697.5657 706.4974 742.5907 763.1158 777.7985 785.4562 799.7809 801.3488 809.6177 815.4772 821.6767 840.9713 854.5118 891.9905 898.9027 914.1423 934.1197 954.6999 978.9651 990.3240 994.6326 997.2911 1000.1527 1019.6530 1023.1491 1028.3321 1032.0300 1049.4119 1055.2624 1060.9734 1070.9161 1083.3574 1090.0255 1096.8718 1108.7480 1112.6606 1122.0186 1129.0871 1135.4921 1138.5501 1157.1029 1163.7709 1172.8637 1175.4615 1190.7950 1191.5573 1194.9852 1199.5115 1227.1949 1246.3591 1247.9623 1266.1198 1272.5064 1285.5656 1293.1901 1297.7202 1300.9152 1316.3600 1323.2021 1330.2353 1333.3584 1343.5222 1349.8537 1352.7445 1355.0614 1363.4142 1371.3191 1378.4305 1384.7458 1400.6376 1400.9370 1433.8431 1441.3463 1442.5888 1447.1867 1449.6578 1457.5505 1457.9468 1463.1379 1463.7482 1474.0389 1474.3575 1477.9202 1484.0836 1486.4865 1487.9691 1589.5531 1605.1528 1614.0856 2827.3038 2841.3329 2850.3658 2852.1994 2858.1738 2869.0945 2952.8642 2957.1933 2995.4643 3003.4513 3009.7727 3011.1160 3025.6425 3026.9553 3029.4526 3040.6801 3041.5660 3044.6541 3068.1810 3078.0124 3078.4977 3080.7313 3081.9588 3091.8557 3107.2366 3121.2112 3128.7389 3141.5365 3155.8254 3167.5567
redmass: 2.9981 4.9025 3.8041 4.6045 3.6800 2.6356 4.3119 4.6011 3.6755 3.1488 3.2707 3.9718 3.1158 3.0925 2.8213 2.4467 1.7999 2.5523 1.9156 3.5412 2.7675 2.5587 2.9207 3.2211 3.9009 3.3204 2.0312 1.9542 2.8372 3.0975 3.8344 3.3652 3.2287 3.2873 4.3403 4.0442 2.2965 1.9852 6.2077 4.2128 6.0931 1.7148 3.6053 2.7657 2.5965 3.2783 1.1044 1.3677 3.3551 2.1995 2.1113 1.6064 1.2506 3.6617 2.3875 1.8529 2.2451 2.3267 1.3943 5.6029 1.6183 1.8843 2.6635 1.6758 2.2718 2.1708 2.3557 2.9476 2.1322 2.0094 2.1869 1.7120 3.5340 2.8966 2.4021 2.2847 2.8624 2.6659 1.4754 2.9245 2.8314 2.5404 1.2412 1.5637 1.7540 1.1042 2.0136 1.1744 1.2800 1.2821 1.1376 1.3102 1.3611 1.4219 1.2770 1.2631 1.3871 1.3198 1.3461 1.3984 1.2812 1.2743 1.4441 1.3379 1.4041 1.4252 1.2712 5.9105 1.4474 1.2757 1.4373 2.1374 1.1219 1.0821 1.0806 1.0958 1.0943 1.0985 1.0405 1.0878 1.0761 1.0609 1.0964 2.1007 1.0698 1.0956 5.9835 7.6936 7.6286 1.0709 1.0711 1.0705 1.0705 1.0697 1.0690 1.0665 1.0665 1.0359 1.0627 1.0582 1.0620 1.0872 1.0879 1.0850 1.0895 1.0905 1.0877 1.1065 1.1010 1.0961 1.1015 1.0979 1.0985 1.1025 1.0847 1.0881 1.0935 1.0961 1.0987
irintensity: 0.1477 0.0124 0.5241 0.3170 0.0924 0.3552 0.4718 1.5141 0.2248 0.3799 0.4673 0.1569 1.5430 6.7872 3.9802 1.1038 3.0150 3.3435 2.0185 3.2803 0.5734 6.1942 7.0396 2.3351 11.5911 6.7569 2.6425 0.7032 0.0424 5.2961 1.0658 0.9454 1.5350 0.7379 6.8687 17.5818 1.2995 3.3909 0.1986 8.1014 2.8330 51.7331 12.3872 14.8719 16.5803 1.3896 3.4656 2.0384 23.5754 3.6798 7.8276 0.5149 0.2344 17.0559 6.9818 3.1756 3.9434 2.4043 0.0604 0.5533 11.4496 16.1093 55.3410 6.9051 65.8679 9.0948 5.6175 7.3147 33.0951 22.0518 19.0764 16.1646 5.9536 180.0839 83.5156 15.8777 85.3943 33.6856 10.0578 32.3226 10.7230 66.4280 1.8286 3.8746 4.3896 2.1815 5.0343 1.9145 7.8140 9.7175 0.1817 0.9509 24.7096 27.5460 7.6741 14.7423 5.8415 18.2100 1.4971 1.6614 1.2511 6.3418 4.2393 2.3030 1.2575 1.4192 1.0189 0.0248 1.6375 23.1854 3.1647 12.6377 5.6044 2.4661 2.5452 18.7479 6.7520 19.6955 10.1988 3.6749 2.3741 3.2175 6.1515 27.7714 13.2955 12.6347 3.6139 86.9854 53.6370 62.2189 103.9948 30.5397 23.0220 132.8465 168.9527 30.9015 106.5288 20.6057 14.3858 20.2124 22.7111 1.4028 53.8508 35.5485 30.6768 51.6076 42.8663 7.6645 14.5302 41.1018 22.2463 36.7256 29.8557 41.1661 1.7540 3.3683 22.3647 36.6698 14.6514
temp: 298.150 k
press: 1.00000 atm
elementType: 8 8 8 7 7 6 6 6 6 6 6 6 6 6 6 6 6 6 6 6 6 6 6 6 6 1 1 1 1 1 1 1 1 1 1 1 1 1 1 1 1 1 1 1 1 1 1 1 1 1 1 1 1 1 1
symmnumber: 1
zpe: 1236791.9 jmol-1
zpe.correction: 0.471069 hartree
zpe.thermalcorrener: 0.495895 hartree
zpe.thermalcorrenthalpy: 0.496839 hartree
zpe.thermalcorrgfe: 0.411757 hartree
zpe.sumelectzpe: -1113.327855 hartree
zpe.sumelectthermal: -1113.303029 hartree
zpe.sumelectthermalent: -1113.302085 hartree
zpe.sumelectthermalfe: -1113.387167 hartree
dipole: -2.4720 0.9885 -1.4342
dipole: 3.0240
quadrupole: -164.7404 -138.2768 -151.3949
quadrupole: -3.6243 0.0267 -1.7966
quadrupole: -13.2697 13.1939 0.0758 -3.6243 0.0267 -1.7966
hfenergy: -1113.7989243 hartree
pointgroup: C01 [X(C20H30N2O3)]
dipole: 0.9815955 -0.3631036 -0.5657959 debye
polarizability: 287.3102334|22.2058206|215.0900247|1.113673|-0.9876277|203.7605771 unknown
InChI: InChI=1S/C20H30N2O3/c1-2-25-19(23)20(18-6-4-3-5-7-18)8-10-21(11-9-20)12-13-22-14-16-24-17-15-22/h3-7H,2,8-17H2,1H3
charge 0 multiplicity 1
55 atoms
O  2.746468 -2.038492 -0.278507
O  2.165579 -1.441463 1.88746
O  -7.651278 -0.126704 0.136135
N  -0.997782 0.267493 -0.427732
N  -4.807278 0.350158 -0.284457
C  1.95683 0.245656 0.059894
C  1.317427 0.112224 -1.348312
C  0.941957 0.99666 0.976676
C  -0.080952 -0.528122 -1.283679
C  -0.461048 0.359644 0.956239
C  -2.379393 -0.274042 -0.472645
C  3.314888 0.998005 0.047031
C  2.264516 -1.142329 0.673014
C  -3.419425 0.714231 0.097519
C  4.005188 1.205227 1.272172
C  3.895007 1.497681 -1.145225
C  -5.295615 -0.882159 0.391045
C  -5.75642 1.468388 -0.038183
C  -6.708551 -1.231459 -0.104524
C  -7.160293 1.08889 -0.535448
C  5.232403 1.900065 1.304442
C  5.123208 2.197848 -1.114106
C  5.797207 2.40439 0.109669
C  3.19762 -3.368036 0.239893
C  3.679843 -4.168901 -0.964627
H  1.20854 1.126353 -1.776722
H  1.963345 -0.485816 -2.013902
H  1.311092 1.014859 2.01646
H  0.874661 2.039829 0.615859
H  -0.508534 -0.571567 -2.302578
H  0.007665 -1.58634 -0.919357
H  -0.41969 -0.650288 1.44019
H  -1.140513 0.983933 1.562627
H  -2.439488 -1.260378 0.056711
H  -2.645879 -0.450076 -1.531474
H  -3.317872 0.799682 1.209583
H  -3.195006 1.707849 -0.332846
H  3.586327 0.80736 2.204091
H  3.398385 1.344019 -2.107341
H  -4.616883 -1.722939 0.160287
H  -5.317574 -0.751937 1.503891
H  -5.814632 1.727057 1.050077
H  -5.402771 2.363981 -0.583511
H  -7.120148 -2.094804 0.444311
H  -6.672257 -1.461343 -1.191577
H  -7.13212 0.923629 -1.63426
H  -7.894734 1.875818 -0.296303
H  5.748279 2.046574 2.260215
H  5.552637 2.579104 -2.047729
H  6.749182 2.94651 0.133054
H  2.346914 -3.846381 0.758222
H  3.997343 -3.192215 0.982062
H  4.513703 -3.653788 -1.471262
H  2.865193 -4.314676 -1.694684
H  4.033532 -5.163061 -0.635335
