program: Gaussian 09
title: 000061114
version: EM64L-G09RevD.01
frameworkgroup: C1[X(C17H21NO2)]
method: RPBEPBE
basis: SDD
operation: Freq
keyword: #p
keyword: freq=noraman
keyword: PBEPBE/SDD
title: #p freq=noraman PBEPBE/SDD
converged: NO YES NO NO
title: Mulliken charges:
elementType: O O N C C C C C C C C C C C C C C C C C H H H H H H H H H H H H H H H H H H H H H
charge: -0.281065 -0.432691 -0.087551 0.245888 -0.150567 -0.140871 -0.221684 -0.450383 0.025864 -0.482901 -0.437690 -0.572210 -0.426496 -0.389058 0.394826 0.019570 -0.643810 -0.424360 0.103742 -0.350157 0.222223 0.206330 0.242587 0.196167 0.239252 0.200778 0.226162 0.229593 0.218500 0.216050 0.217261 0.224311 0.174997 0.206531 0.193721 0.226785 0.222235 0.190808 0.233068 0.243211 0.371030
chargesum: 0.00000
title: Mulliken charges with hydrogens summed into heavy atoms:
elementType: O O N C C C C C C C C C C C C C C C C C
charge: -0.281065 -0.061661 -0.087551 0.245888 0.071656 0.065459 0.020903 -0.014964 0.025864 -0.055960 0.010404 -0.138898 -0.027188 0.011194 0.394826 0.019570 -0.003982 -0.191291 0.103742 -0.106945
polarizability: 2.10583807e+02 -4.48213731e+00 1.83814093e+02 5.58844721e+00 1.66608848e+01 1.53733998e+02
1716.lowfreq: -11.5813 -0.0009 -0.0004 -0.0001 3.2851 18.8010 59.7177 81.8644 112.7078
frequency: 59.7059 81.8300 112.7076 148.0816 167.3453 192.8352 206.8361 227.9473 247.9575 269.4777 294.0521 303.9601 304.8028 336.8422 349.8517 385.0232 391.6211 397.2747 433.3006 444.7444 452.1518 502.9012 507.0599 521.0476 547.0546 555.1264 575.7353 603.7530 608.3084 638.4202 698.1522 719.7207 735.9108 775.1586 797.1437 804.6379 814.7282 844.9980 868.0341 886.5345 898.9100 917.2468 926.7486 941.0434 962.6721 976.8721 997.4392 1013.0492 1028.8666 1048.3575 1075.4915 1077.5385 1086.3840 1104.3565 1115.7541 1121.0367 1139.6132 1142.1209 1145.4761 1151.8278 1168.3348 1174.4236 1182.4987 1189.1277 1214.9410 1221.5066 1233.2404 1247.8105 1255.8769 1270.9431 1294.4907 1310.6521 1317.3945 1319.8809 1325.3999 1332.9258 1338.0915 1339.1669 1346.5582 1352.0307 1359.0644 1370.7384 1411.0093 1431.3625 1438.9820 1453.1083 1456.6040 1463.9766 1467.5797 1468.4164 1474.6827 1479.5647 1494.7158 1502.6724 1618.7072 1644.5382 2818.0075 2846.3308 2891.9932 2960.2986 2969.3232 2970.5254 2982.5331 2986.2393 2994.6335 3009.8674 3013.7126 3023.5125 3036.5550 3043.6966 3050.6091 3060.6416 3067.5541 3073.6833 3126.6914 3163.3710 3563.3201
redmass: 3.7273 4.0149 4.3855 2.7158 2.6801 2.1163 3.1784 1.3457 4.2527 2.6313 2.7714 2.5096 2.8723 3.5912 3.8918 1.4750 2.0342 3.4181 4.6514 3.7215 3.2466 3.6602 3.6018 2.5703 4.2767 3.9513 3.8116 6.0223 3.2453 4.0008 5.4035 3.3010 4.4019 3.2662 1.4550 4.7545 1.9568 2.1379 2.6797 3.9103 1.8493 2.1120 1.5521 2.6113 2.1333 2.4760 2.2505 2.4556 2.0343 2.1514 2.7847 2.1582 1.7253 1.7439 1.8204 2.3679 1.6248 2.0750 2.1039 1.5656 1.4488 1.6513 1.5622 1.6979 1.3851 1.6391 1.6018 1.8617 1.3638 1.5400 1.8132 1.4753 1.7689 1.5228 1.3776 1.3701 1.4224 1.7139 1.4770 1.4824 1.4233 1.3967 6.1632 3.6099 1.1792 1.1445 1.1062 1.0967 1.0877 1.0518 1.0918 1.0578 1.0810 3.6319 8.8539 8.7963 1.0720 1.0584 1.0832 1.0662 1.0767 1.0704 1.0607 1.0631 1.0614 1.0713 1.0856 1.0938 1.0972 1.1005 1.0978 1.0999 1.1005 1.0942 1.0887 1.0945 1.0659
irintensity: 0.0680 0.3745 0.0643 1.0049 0.2516 2.0455 1.5023 1.8457 1.8281 4.3729 1.7078 0.8685 0.9248 2.7234 1.6466 111.9547 31.7139 5.0616 5.7943 1.3967 2.6912 1.1396 0.2655 0.5988 4.4681 12.7642 6.0873 9.0198 4.0712 1.9831 0.8872 3.8800 1.6992 5.0290 32.6122 52.4102 7.8567 15.5057 2.2446 17.1226 12.8114 4.4327 4.9090 12.6931 3.7920 2.0194 29.4728 22.8594 6.2879 4.9979 28.7672 8.7453 17.2927 12.8636 4.1314 8.7870 42.2407 43.6011 53.7063 9.1907 11.9801 82.8465 53.1454 3.3130 2.7491 10.1507 10.2383 11.2883 0.6234 15.2538 5.1510 8.4746 15.8559 5.7492 4.6494 4.4058 7.2405 1.7454 6.7278 4.4319 3.0939 7.8941 5.3134 43.5536 2.2956 27.1818 19.4390 8.0232 9.6924 16.7786 9.9913 8.1797 3.4941 52.0924 31.5856 20.0808 88.6918 189.4611 81.8110 49.8279 10.9075 65.9366 37.9641 31.2035 17.9858 44.1369 48.3962 27.2888 52.7903 51.2897 11.1722 19.1101 33.5819 76.0673 12.5284 12.5027 51.6727
temp: 298.150 k
press: 1.00000 atm
elementType: 8 8 7 6 6 6 6 6 6 6 6 6 6 6 6 6 6 6 6 6 1 1 1 1 1 1 1 1 1 1 1 1 1 1 1 1 1 1 1 1 1
symmnumber: 1
zpe: 911002.3 jmol-1
zpe.correction: 0.346982 hartree
zpe.thermalcorrener: 0.363195 hartree
zpe.thermalcorrenthalpy: 0.364139 hartree
zpe.thermalcorrgfe: 0.305413 hartree
zpe.sumelectzpe: -864.100349 hartree
zpe.sumelectthermal: -864.084136 hartree
zpe.sumelectthermalent: -864.083192 hartree
zpe.sumelectthermalfe: -864.141919 hartree
dipole: -3.6467 2.4586 -0.7203
dipole: 4.4567
quadrupole: -121.8503 -114.9809 -115.9265
quadrupole: 5.0276 -0.3367 2.9650
quadrupole: -4.2644 2.6051 1.6594 5.0276 -0.3367 2.9650
hfenergy: -864.4473315 hartree
pointgroup: C01 [X(C17H21N1O2)]
dipole: -1.4634669 0.8207759 -0.508891 debye
polarizability: 210.1967344|-2.7440841|187.9075412|8.6873397|11.377941|150.0276223 unknown
InChI: InChI=1S/C17H21NO2/c1-18-8-7-17-11-3-2-4-14(17)20-16-13(19)6-5-10(15(16)17)9-12(11)18/h5-6,11-12,14,19H,2-4,7-9H2,1H3
charge 0 multiplicity 1
41 atoms
O  1.767913 1.406651 1.106816
O  4.104619 -0.500109 0.980351
N  -2.675496 -0.976074 0.530003
C  -0.507788 0.864707 0.412655
C  -1.571181 0.908015 -0.715374
C  -2.157807 -0.541049 -0.808462
C  0.502173 2.053267 0.511332
C  -1.238543 0.619113 1.784645
C  0.466274 -0.264484 0.103702
C  -1.007359 1.463277 -2.039785
C  0.8847 2.677666 -0.847415
C  -1.121504 -1.596768 -1.304521
C  -2.661711 0.045866 1.593103
C  -0.335962 2.835046 -1.78945
C  0.227621 -1.442688 -0.613843
C  1.729015 0.07957 0.597254
C  -3.92079 -1.752397 0.455561
C  1.321397 -2.346239 -0.721739
C  2.81766 -0.803396 0.499248
C  2.584405 -2.040453 -0.155826
H  -2.396921 1.583647 -0.410374
H  -2.995967 -0.510551 -1.544762
H  0.201705 2.813812 1.250699
H  -1.316944 1.573249 2.342633
H  -0.636207 -0.074642 2.396455
H  -1.824694 1.559296 -2.781207
H  -0.257285 0.770122 -2.46713
H  1.622243 2.013346 -1.337573
H  1.385897 3.648158 -0.678453
H  -0.985933 -1.504858 -2.403246
H  -1.545351 -2.603298 -1.125199
H  -2.988302 -0.438583 2.533192
H  -3.390463 0.877967 1.404315
H  -0.000934 3.280466 -2.745183
H  -1.075277 3.53766 -1.351862
H  -4.142912 -2.203824 1.439936
H  -3.809363 -2.576441 -0.272651
H  -4.810298 -1.145079 0.146218
H  1.199707 -3.291594 -1.263619
H  3.423131 -2.738148 -0.246447
H  4.103535 0.410777 1.370502
