program: Gaussian 09
title: 000061105
version: EM64L-G09RevD.01
frameworkgroup: C1[X(C2HCl4F)]
method: RPBEPBE
basis: SDD
operation: Freq
keyword: #p
keyword: freq=noraman
keyword: PBEPBE/SDD
title: #p freq=noraman PBEPBE/SDD
converged: NO NO NO NO
title: Mulliken charges:
elementType: Cl Cl Cl Cl F C C H
charge: 0.104386 0.104370 0.089087 0.089034 -0.082300 -0.158126 -0.502936 0.356486
chargesum: 0.00000
title: Mulliken charges with hydrogens summed into heavy atoms:
elementType: Cl Cl Cl Cl F C C
charge: 0.104386 0.104370 0.089087 0.089034 -0.082300 -0.158126 -0.146450
polarizability: 6.03964391e+01 2.56432567e-03 8.10948864e+01 -6.43984188e+00 2.70325623e-04 3.49398742e+01
1716.lowfreq: -9.4385 -0.0030 0.0006 0.0015 13.4197 15.1088 59.4820 148.3052 197.8903
frequency: 59.4431 148.3041 197.8903 208.2837 252.5522 268.7272 323.7609 347.9945 405.1429 655.0399 692.2386 702.5041 767.6356 898.7046 1092.2695 1179.9824 1252.9023 3147.7062
redmass: 26.8831 30.9469 16.2912 34.3629 22.8233 24.2262 18.1804 25.9450 19.5938 11.2191 7.4305 10.8816 10.4461 5.3665 12.1077 1.0738 1.2208 1.0884
irintensity: 0.0004 0.7002 1.1994 0.0193 0.4308 0.4498 2.4376 0.0857 4.3804 105.5189 7.1237 212.9134 66.2690 111.8032 63.8301 3.8527 2.1715 0.6778
temp: 298.150 k
press: 1.00000 atm
elementType: 17 17 17 17 9 6 6 1
symmnumber: 1
zpe: 75371.2 jmol-1
zpe.correction: 0.028707 hartree
zpe.thermalcorrener: 0.036676 hartree
zpe.thermalcorrenthalpy: 0.037620 hartree
zpe.thermalcorrgfe: -0.005754 hartree
zpe.sumelectzpe: -2016.317625 hartree
zpe.sumelectthermal: -2016.309656 hartree
zpe.sumelectthermalent: -2016.308712 hartree
zpe.sumelectthermalfe: -2016.352085 hartree
dipole: 0.1114 0.0002 -1.7949
dipole: 1.7983
quadrupole: -69.1822 -67.4673 -67.0223
quadrupole: -0.0005 -0.1710 0.0000
quadrupole: -1.2916 0.4233 0.8683 -0.0005 -0.1710 0.0000
hfenergy: -2016.3463319 hartree
pointgroup: C01 [X(C2H1Cl4F1)]
dipole: 0.0009773 -0.0000944 -0.7075161 debye
dipolederiv: -0.3419082 0.274578 -0.0937694 0.2278363 -0.5503954 0.1445808 -0.0398465 0.1262515 -0.1523102 -0.3420171 -0.2746324 -0.0937868 -0.2278823 -0.5503361 -0.1445481 -0.0398518 -0.1262209 -0.1523045 -0.2906678 0.237925 -0.0298005 0.167604 -0.4959842 0.0546079 -0.0312652 0.0982691 -0.0824257 -0.2907517 -0.2379515 -0.029806 -0.1676243 -0.4959584 -0.0546052 -0.0312739 -0.0982628 -0.0824588 -0.3270058 -0.0000016 -0.034809 -0.0000011 -0.2934524 -0.0000031 -0.117301 0.0000067 -0.8653431 0.998576 0.0000732 0.1847758 0.0000464 1.3731577 -0.0000275 0.2209132 -0.0000516 1.1781559 0.5792726 0.0000162 0.155646 0.0000186 1.0355725 -0.0000099 0.0571341 0.0000083 0.132257 0.0145021 -0.000007 -0.0584502 0.0000023 -0.0226038 0.0000051 -0.018509 -0.0000002 0.0244294 unknown
polarizability: 59.4804414|0.0033215|81.0948862|7.9969163|-0.0007397|35.8558721 unknown
InChI: InChI=1S/C2HCl4F/c3-1(4)2(5,6)7/h1H
charge 0 multiplicity 1
8 atoms
Cl -1.552432 1.510918 -0.464506
Cl -1.552721 -1.510668 -0.464443
Cl 1.748271 -1.517339 -0.047941
Cl 1.748522 1.517091 -0.047917
F  -0.553644 0.000071 1.490704
C  -0.613157 0.000056 0.0833
C  0.801665 -0.000098 -0.544763
H  0.729797 -0.000033 -1.639234
