program: Gaussian 09
title: 000061081
version: EM64L-G09RevD.01
frameworkgroup: C1[X(C14H29NO3)]
method: RPBEPBE
basis: SDD
operation: Freq
keyword: #p
keyword: freq=noraman
keyword: PBEPBE/SDD
title: #p freq=noraman PBEPBE/SDD
converged: YES YES NO NO
title: Mulliken charges:
elementType: O O O N C C C C C C C C C C C C C C H H H H H H H H H H H H H H H H H H H H H H H H H H H H H
charge: -0.285876 -0.445975 -0.440827 -0.150212 -0.384054 -0.371754 -0.380807 -0.387781 -0.372755 -0.532283 -0.353192 0.259441 -0.356765 -0.370823 -0.361186 -0.697123 -0.325530 -0.314952 0.196869 0.193595 0.187738 0.183880 0.191115 0.189329 0.230953 0.207247 0.190444 0.189263 0.236584 0.220425 0.186639 0.187442 0.194715 0.195278 0.232380 0.260404 0.193064 0.282875 0.209123 0.214691 0.209616 0.199008 0.202574 0.203380 0.186299 0.349634 0.347891
chargesum: 0.00000
title: Mulliken charges with hydrogens summed into heavy atoms:
elementType: O O O N C C C C C C C C C C C C C C
charge: -0.285876 -0.096342 -0.092935 -0.150212 0.006411 -0.000136 -0.000364 0.050418 0.006952 -0.075273 0.020889 0.259441 0.033228 0.121962 0.114753 -0.063694 0.076053 0.074727
polarizability: 2.18443075e+02 -2.81797746e+00 1.59208135e+02 -1.98935553e+00 4.23412165e+00 1.39653940e+02
1716.lowfreq: -12.0975 -4.6877 -0.0012 0.0001 0.0012 5.3987 14.3987 19.5483 26.0541
frequency: 14.1360 17.6492 26.0323 37.9081 50.1194 54.2799 65.8024 72.7046 83.0361 91.3019 94.2497 115.0786 125.0978 146.4837 150.9583 159.3694 168.7449 186.2172 228.2514 234.6566 246.6800 257.7066 297.6236 314.2517 332.9690 349.7704 392.8722 402.9026 425.3053 469.9862 486.4308 537.0871 578.3574 645.3927 723.3050 725.4370 737.5514 770.4158 780.3344 805.3087 823.1090 845.2457 882.1070 886.0921 889.0645 951.5732 976.0564 989.9387 990.8938 1002.2867 1014.2335 1018.6687 1033.5861 1041.8641 1057.1146 1059.9266 1074.1094 1079.2215 1085.1092 1102.1962 1109.3768 1124.0211 1166.9545 1181.8880 1185.5718 1186.0332 1208.2339 1209.6573 1216.4971 1243.3913 1249.2086 1250.6616 1268.8324 1277.2307 1281.5907 1282.7673 1289.1182 1292.0535 1296.1740 1299.0533 1310.8802 1332.5250 1338.5763 1351.1196 1354.6845 1358.0215 1364.9192 1388.4171 1399.5919 1408.6368 1411.8798 1441.7251 1451.2483 1459.6480 1460.5053 1463.4895 1466.5337 1472.5273 1475.0370 1477.9191 1479.0007 1481.1321 1484.8531 1488.4104 1495.1079 1590.6549 2925.9591 2945.1449 2946.0361 2948.7248 2949.5900 2954.3892 2961.0521 2961.8026 2967.7328 2967.8495 2970.5194 2978.5070 2981.9230 2985.9697 2993.7814 2997.3093 2997.6114 3009.8123 3012.0540 3025.8442 3036.2541 3038.9824 3064.7173 3067.2089 3069.7340 3077.0309 3100.4334 3571.5005 3579.4918
redmass: 4.6505 4.2053 4.4184 3.7770 1.7199 4.3784 4.2862 2.1772 3.1697 2.0632 3.9417 2.2118 2.0375 2.3681 2.0049 3.6215 2.9121 2.8340 1.8175 1.1037 1.8189 1.0937 2.4559 3.4511 3.6102 3.4009 2.7907 5.4959 3.0052 3.2481 2.9661 2.8843 2.6246 4.5199 1.0609 1.0781 1.1220 1.2099 3.2071 1.2644 1.2714 2.2725 1.9575 1.5755 1.9878 1.2570 4.1949 4.5031 3.0379 3.6867 1.3231 2.0025 3.3394 3.1634 1.8809 2.8481 2.6110 2.0621 2.2825 1.4213 1.8291 2.7362 1.3683 1.4512 1.3861 1.3761 1.2429 1.3131 1.4683 1.3335 1.7453 1.3228 1.3743 1.2021 1.2195 1.0710 1.1533 1.2348 1.1203 1.1146 1.3690 1.3677 1.3535 1.5823 1.6552 1.6582 1.4032 1.2175 1.8751 1.6229 1.5097 1.1022 1.0845 1.0744 1.0741 1.0658 1.0789 1.0796 1.0837 1.0423 1.0831 1.0778 1.0894 1.0922 1.0854 8.0264 1.0572 1.0589 1.0547 1.0587 1.0590 1.0594 1.0595 1.0595 1.0584 1.0756 1.0370 1.0956 1.0963 1.0976 1.0936 1.0826 1.0954 1.1009 1.0980 1.1046 1.0623 1.1045 1.1025 1.1008 1.0993 1.0937 1.1016 1.0666 1.0668
irintensity: 0.8311 0.7435 0.6394 0.6550 0.2381 3.0697 2.0532 0.9087 5.9189 7.3469 4.2571 0.6177 3.2590 8.0949 0.0039 3.7167 12.3208 12.4381 64.3046 0.0380 52.2568 148.8452 19.1255 21.7909 1.2530 7.1624 5.2108 6.4402 8.4077 4.0290 4.2903 3.6321 15.6359 13.9541 17.5138 0.3614 4.1453 0.4298 10.5706 5.3187 1.6825 31.1343 2.2501 2.0718 2.6929 1.9860 107.3917 1.1770 2.7502 3.0186 1.2579 4.0492 49.4540 1.1928 14.3198 38.1813 1.2823 1.3108 7.8926 7.4277 9.9736 17.0435 46.6051 27.2278 10.7072 19.0862 29.5567 37.4728 3.5134 2.3688 15.9360 0.1149 24.1316 3.8077 10.5380 4.0950 10.1333 12.7193 0.1239 0.2209 5.6749 1.1327 0.8064 1.2270 0.5498 0.7266 15.7953 11.3436 76.1171 33.2792 21.5794 24.1810 27.9369 0.2307 0.2422 0.0884 0.4841 2.7564 6.5479 12.3302 1.7904 7.3766 4.3120 30.9913 13.0974 241.2893 63.3061 7.0358 49.4619 0.8262 2.2071 0.9694 21.2835 60.4302 145.9141 51.4065 35.3106 99.7261 1.6182 2.4502 6.9500 35.3865 51.8806 8.3461 7.7921 0.3337 35.7488 145.5812 62.6632 112.1420 56.1916 11.4741 22.8305 4.1953 4.4246
temp: 298.150 k
press: 1.00000 atm
elementType: 8 8 8 7 6 6 6 6 6 6 6 6 6 6 6 6 6 6 1 1 1 1 1 1 1 1 1 1 1 1 1 1 1 1 1 1 1 1 1 1 1 1 1 1 1 1 1
symmnumber: 1
zpe: 1089298.5 jmol-1
zpe.correction: 0.414892 hartree
zpe.thermalcorrener: 0.438606 hartree
zpe.thermalcorrenthalpy: 0.439550 hartree
zpe.thermalcorrgfe: 0.356871 hartree
zpe.sumelectzpe: -829.791033 hartree
zpe.sumelectthermal: -829.767319 hartree
zpe.sumelectthermalent: -829.766375 hartree
zpe.sumelectthermalfe: -829.849054 hartree
dipole: -3.0842 3.1857 0.3415
dipole: 4.4472
quadrupole: -84.6626 -114.0029 -112.7897
quadrupole: -3.9885 -0.7537 -13.0746
quadrupole: 19.1558 -10.1845 -8.9713 -3.9885 -0.7537 -13.0746
hfenergy: -830.2059247 hartree
pointgroup: C01 [X(C14H29N1O3)]
dipole: 1.2139943 1.2558535 -0.1018065 debye
polarizability: 218.3876161|2.7608422|159.4981344|-2.9306331|-3.4990378|139.4193998 unknown
InChI: InChI=1S/C14H29NO3/c1-2-3-4-5-6-7-8-9-14(18)15(10-12-16)11-13-17/h16-17H,2-13H2,1H3
charge 0 multiplicity 1
47 atoms
O  2.298699 -1.789531 1.039298
O  4.25877 3.53359 -0.253147
O  4.960732 -2.022085 -1.642181
N  3.662104 -0.130942 0.134481
C  -2.717805 -0.423002 0.375306
C  -1.390337 0.161176 -0.158192
C  -3.970826 0.243633 -0.23552
C  -0.145729 -0.540627 0.427792
C  -5.297648 -0.328866 0.312271
C  1.170607 0.077669 -0.082705
C  -6.551935 0.324044 -0.311239
C  2.4078 -0.689149 0.413763
C  -7.878446 -0.244244 0.243083
C  3.843287 1.183987 -0.501793
C  4.867678 -0.901144 0.504251
C  -9.126436 0.408698 -0.389809
C  3.994276 2.31796 0.53097
C  5.771427 -1.266347 -0.682474
H  -2.745216 -1.513281 0.169362
H  -2.746136 -0.316338 1.47997
H  -1.374668 0.07697 -1.265673
H  -1.353309 1.247735 0.070832
H  -3.948259 0.122797 -1.339078
H  -3.936801 1.336744 -0.042714
H  -0.159752 -1.616924 0.176425
H  -0.16802 -0.490389 1.533696
H  -5.326303 -1.423746 0.130333
H  -5.325482 -0.197363 1.414462
H  1.17649 0.072741 -1.193003
H  1.225224 1.142543 0.220188
H  -6.522524 1.420011 -0.134989
H  -6.528287 0.186704 -1.412846
H  -7.902817 -0.10304 1.343084
H  -7.904637 -1.339677 0.070519
H  4.749659 1.169467 -1.132023
H  3.001861 1.417565 -1.172081
H  5.478296 -0.33906 1.241596
H  4.50191 -1.822669 0.987496
H  -9.138223 1.499964 -0.206646
H  -10.060712 -0.013655 0.02415
H  -9.141531 0.253682 -1.485366
H  4.83544 2.095849 1.221518
H  3.063646 2.416507 1.128849
H  6.611673 -1.875988 -0.284267
H  6.204719 -0.358514 -1.15799
H  4.327296 4.313765 0.351432
H  5.536145 -2.355519 -2.375291
