program: Gaussian 09
title: 000061072
version: EM64L-G09RevD.01
frameworkgroup: C1[X(C14H22O)]
method: RPBEPBE
basis: SDD
operation: Freq
keyword: #pfreq=noraman
keyword: PBEPBE/SDD
title: #p freq=noraman PBEPBE/SDD
converged: YES YES NO NO
title: Mulliken charges:
elementType: O C C C C C C C C C C C C C C H H H H H H H H H H H H H H H H H H H H H H
charge: -0.244393 0.201484 -0.444229 -0.450863 0.257086 -0.512142 0.211222 -0.747039 -0.756614 -0.243308 -0.841981 -0.348016 0.173658 -0.490952 -0.680778 0.201184 0.204188 0.208147 0.207893 0.222335 0.221670 0.220486 0.236159 0.213136 0.217124 0.220141 0.224532 0.248927 0.225950 0.259851 0.230355 0.237227 0.224843 0.227425 0.230242 0.205701 0.229347
chargesum: 0.00000
title: Mulliken charges with hydrogens summed into heavy atoms:
elementType: O C C C C C C C C C C C C C C
charge: -0.244393 0.201484 -0.038856 -0.034823 0.257086 -0.068136 0.211222 -0.077257 -0.094817 0.005620 -0.125826 -0.110789 0.173658 -0.038684 -0.015488
polarizability: 2.26649050e+02 1.30342836e+01 1.60067781e+02 -2.45814052e+00 3.62554040e+00 1.12132445e+02
1716.lowfreq: -5.0025 0.0005 0.0007 0.0009 3.5388 12.6264 33.9742 39.1650 48.7436
frequency: 33.7595 39.1614 48.7363 69.1746 105.1459 128.7139 137.1872 186.4333 187.9058 203.1855 235.6063 250.9019 262.4226 270.3538 295.5709 298.7564 321.6490 359.2227 367.0738 392.8218 417.0038 450.7975 475.6639 503.6422 535.6197 568.3944 614.6666 644.7923 696.1548 783.8630 797.7759 830.5285 853.1176 876.7191 891.0269 920.6239 926.1463 941.1649 976.9338 988.6023 1001.4122 1005.6997 1010.1518 1025.7117 1045.2096 1051.2097 1065.8047 1082.1636 1121.8094 1124.1529 1157.3697 1178.7481 1197.5138 1200.6926 1211.5980 1238.9392 1259.7320 1274.4987 1304.1058 1322.5184 1335.6527 1340.2858 1344.0769 1356.1475 1377.7037 1390.7687 1394.6852 1397.6167 1433.5746 1441.9299 1459.0629 1464.1824 1465.6813 1466.9744 1472.4828 1475.3876 1477.0286 1477.3210 1487.1780 1492.0028 1555.6888 1610.0658 1633.0674 2937.8440 2957.6529 2958.2276 2965.0707 2971.3143 2977.2314 2981.7391 2995.5128 2996.8850 3001.5585 3028.3768 3030.5301 3046.8330 3065.3183 3070.0175 3073.8005 3081.5828 3087.3604 3091.0688 3093.7958 3098.6485 3138.2013
redmass: 3.7607 2.4382 2.8597 2.8140 3.1268 2.4294 1.8528 1.8447 1.5109 2.1234 1.7114 1.6272 1.2309 1.7738 1.9046 2.5051 2.9784 2.4266 1.9414 2.6631 2.6550 3.5083 3.4942 2.6466 2.4216 2.5588 3.9821 3.5406 3.0191 1.7530 1.9949 1.9225 1.9042 1.9384 1.9578 2.4978 1.5414 2.0196 1.4114 1.6290 1.2689 1.9569 1.2794 1.8307 1.7572 2.1065 1.6614 1.6094 2.0452 1.8411 1.8806 2.5170 2.1764 2.4276 2.0287 1.1912 1.7591 1.3796 1.6342 1.4304 1.5351 1.6273 1.7431 2.0350 1.1867 1.2059 1.2147 1.2002 1.0998 1.1048 1.0711 1.0612 1.0690 1.0395 1.0755 1.0619 1.0702 1.0545 1.0616 1.0590 7.0628 6.5117 5.4510 1.0632 1.0601 1.0404 1.0602 1.0356 1.0368 1.0767 1.0364 1.0795 1.0977 1.0981 1.0942 1.1030 1.0997 1.0986 1.0995 1.0986 1.0976 1.1002 1.0871 1.0996 1.0905
irintensity: 4.5810 0.4253 0.1241 0.3325 0.4207 0.0877 2.1126 0.6017 0.7602 0.3386 1.2237 0.0554 1.1162 2.6351 2.1629 5.9022 4.4895 0.9636 2.2523 4.6711 1.3747 1.7307 1.7956 0.2491 0.9548 0.9820 9.4172 1.2912 8.6359 6.6053 3.7843 2.4285 10.3006 11.3537 4.5985 4.3209 1.1014 2.5179 4.4430 1.1197 24.4397 20.7543 9.3608 31.8036 16.0122 35.3050 1.1827 2.8495 67.2445 17.4334 10.1487 22.0360 11.8742 5.9501 3.1318 0.1034 56.8372 14.0886 7.3182 13.5236 19.9765 21.9255 31.7536 36.6872 21.0222 17.5322 29.4192 10.9373 21.4434 25.3104 3.6609 7.9488 15.1244 11.6247 7.4765 9.2818 21.8391 18.0602 18.6653 14.3843 358.7054 50.3027 47.0835 30.7782 38.2567 36.5823 32.4939 23.5870 33.7037 16.8358 36.3924 51.2324 13.6263 51.6525 26.5703 57.9087 5.5334 82.6524 24.2330 29.9524 14.1888 31.9258 9.2091 32.4564 12.9402
temp: 298.150 k
press: 1.00000 atm
elementType: 8 6 6 6 6 6 6 6 6 6 6 6 6 6 6 1 1 1 1 1 1 1 1 1 1 1 1 1 1 1 1 1 1 1 1 1 1
symmnumber: 1
zpe: 847932.2 jmol-1
zpe.correction: 0.322960 hartree
zpe.thermalcorrener: 0.340149 hartree
zpe.thermalcorrenthalpy: 0.341093 hartree
zpe.thermalcorrgfe: 0.277966 hartree
zpe.sumelectzpe: -620.715023 hartree
zpe.sumelectthermal: -620.697835 hartree
zpe.sumelectthermalent: -620.696891 hartree
zpe.sumelectthermalfe: -620.760018 hartree
dipole: 2.8294 3.0473 1.1402
dipole: 4.3118
quadrupole: -92.7697 -91.6364 -94.0924
quadrupole: -7.9631 -4.4812 -1.2748
quadrupole: 0.0631 1.1964 -1.2596 -7.9631 -4.4812 -1.2748
hfenergy: -621.0379835 hartree
pointgroup: C01 [X(C14H22O1)]
dipole: -1.1020658 1.2201287 -0.4176768 debye
polarizability: 226.2514137|-13.8435427|160.5118136|-3.8085747|-2.6463134|112.086048 unknown
InChI: InChI=1S/C14H22O/c1-5-12(15)8-9-13-11(2)7-6-10-14(13,3)4/h8-9H,5-7,10H2,1-4H3
charge 0 multiplicity 1
37 atoms
O  3.138667 -1.366172 0.493608
C  -1.924219 -1.092893 -0.044209
C  -3.405044 -0.627462 0.079748
C  -3.673621 0.702281 -0.644504
C  -0.934402 0.09917 0.129464
C  -2.826577 1.803577 0.01496
C  -1.368285 1.411564 0.21354
C  -1.691176 -1.751212 -1.437005
C  -1.690909 -2.169589 1.060326
C  0.4800 -0.293127 0.215285
C  -0.476262 2.594549 0.547721
C  1.609694 0.394888 -0.159077
C  2.958865 -0.216168 -0.016131
C  4.134968 0.627103 -0.526378
C  5.502752 -0.05638 -0.37067
H  -3.654742 -0.501541 1.153677
H  -4.059404 -1.431604 -0.309305
H  -4.747503 0.964244 -0.597534
H  -3.408848 0.615775 -1.716232
H  -3.262563 2.075432 1.001753
H  -2.857177 2.736964 -0.584842
H  -1.93955 -1.055831 -2.259306
H  -0.63534 -2.05286 -1.562703
H  -2.320346 -2.655175 -1.544724
H  -2.512435 -2.909862 1.02541
H  -0.747464 -2.726405 0.924538
H  -1.683386 -1.714137 2.067657
H  0.689413 -1.308244 0.585038
H  -0.139547 3.1224 -0.367942
H  0.42236 2.304238 1.116273
H  -1.046868 3.333991 1.141756
H  1.56314 1.387584 -0.620869
H  4.115141 1.598799 0.01152
H  3.937067 0.879312 -1.589797
H  5.704909 -0.290578 0.688588
H  6.312702 0.591757 -0.750991
H  5.527089 -1.012591 -0.920944
