program: Gaussian 09
title: 000061067
version: EM64L-G09RevD.01
frameworkgroup: C1[X(C6H12O2)]
method: RPBEPBE
basis: SDD
operation: Freq
keyword: #pfreq=noraman
keyword: PBEPBE/SDD
title: #p freq=noraman PBEPBE/SDD
converged: YES YES NO NO
title: Mulliken charges:
elementType: O O C C C C C C H H H H H H H H H H H H
charge: -0.287643 -0.295426 0.380976 -0.377326 -0.319626 -0.316603 -0.722009 -0.698623 0.207001 0.212922 0.206745 0.227357 0.207021 0.227008 0.222417 0.229488 0.226724 0.210744 0.246024 0.212830
chargesum: 0.00000
title: Mulliken charges with hydrogens summed into heavy atoms:
elementType: O O C C C C C C
charge: -0.287643 -0.295426 0.380976 0.042598 0.114477 0.117425 -0.043380 -0.029026
polarizability: 8.12919795e+01 -3.22801079e+00 6.55166013e+01 -4.11362138e-01 -4.69760532e-01 6.21978687e+01
1716.lowfreq: -21.9907 -14.4711 -0.0003 0.0007 0.0008 10.9180 46.8599 86.6475 176.7946
frequency: 46.4315 86.5736 176.7455 185.4842 222.6681 253.6770 328.9780 343.6723 423.3071 458.9439 605.9306 612.6885 704.9671 758.2820 794.1673 864.9026 880.3413 920.3431 980.6160 986.3267 1004.2650 1028.8862 1049.9552 1100.4062 1113.0470 1160.8886 1179.2417 1201.9498 1227.2345 1290.2033 1317.0976 1325.1513 1334.3261 1381.6241 1388.4055 1447.8843 1457.5794 1465.1698 1469.8093 1474.4013 1480.3432 1489.1533 2978.4932 2984.9853 2986.0999 2996.2347 3001.0086 3050.6972 3078.0708 3086.7031 3094.2399 3095.7687 3100.9644 3108.3615
redmass: 3.3493 1.8955 1.0588 2.1726 1.2268 2.2304 2.2705 3.0154 3.9497 3.1414 2.5925 3.2701 6.4422 1.7744 1.6347 2.2850 1.9964 2.6495 2.2168 3.1684 1.5497 2.5351 2.2572 1.6721 1.9074 1.1760 1.9046 1.4161 2.2654 1.5222 1.3006 1.2509 1.5427 1.2812 1.2036 1.0669 1.0525 1.0713 1.0873 1.0932 1.0432 1.0568 1.0700 1.0610 1.0363 1.0572 1.0384 1.1011 1.0998 1.0970 1.1029 1.1008 1.0995 1.0999
irintensity: 10.2938 1.0738 0.3971 0.7184 1.2986 0.9587 0.1162 2.1629 11.4433 13.5298 1.5517 4.5556 6.7364 19.1318 26.8854 1.5877 2.9039 37.2528 9.9038 12.3024 16.9965 103.5681 14.8930 6.8262 26.2421 4.1088 64.2318 0.5786 42.5338 17.4090 4.9284 0.6347 9.8191 36.4873 20.8051 2.0319 8.8547 12.5161 4.3826 1.8246 8.1765 13.8893 56.9933 74.4896 32.2287 27.6478 7.8151 10.0900 51.9462 30.3926 32.7531 33.7658 27.7687 25.4372
temp: 298.150 k
press: 1.00000 atm
elementType: 8 8 6 6 6 6 6 6 1 1 1 1 1 1 1 1 1 1 1 1
symmnumber: 1
zpe: 452090.9 jmol-1
zpe.correction: 0.172192 hartree
zpe.thermalcorrener: 0.181269 hartree
zpe.thermalcorrenthalpy: 0.182213 hartree
zpe.thermalcorrgfe: 0.138279 hartree
zpe.sumelectzpe: -385.598598 hartree
zpe.sumelectthermal: -385.589521 hartree
zpe.sumelectthermalent: -385.588577 hartree
zpe.sumelectthermalfe: -385.632511 hartree
dipole: 0.9954 -0.4980 -0.1052
dipole: 1.1180
quadrupole: -42.9992 -49.1394 -53.1715
quadrupole: -2.9806 -2.1533 -2.8218
quadrupole: 5.4375 -0.7027 -4.7348 -2.9806 -2.1533 -2.8218
hfenergy: -385.7707899 hartree
pointgroup: C01 [X(C6H12O2)]
dipole: -0.3932266 -0.1919828 -0.0446323 debye
dipolederiv: -0.9485552 -0.1035716 -0.1709972 -0.0762129 -0.4880955 -0.0024342 -0.1508698 0.0159232 -0.5560242 -0.8868264 -0.1938809 0.0706608 -0.2396196 -0.5758374 0.0636802 0.0536636 0.0865472 -0.524244 1.0543097 0.1584487 0.0348697 0.1868905 0.6411599 0.0447074 -0.0304964 0.0982634 0.739862 -0.054812 0.0175127 0.020924 0.0715007 0.0598018 -0.0484674 0.0799818 -0.0550557 -0.0364977 0.4543094 0.0641201 0.0838683 0.2599756 0.3378216 0.1851815 -0.0192078 0.076213 0.2452837 0.6199283 0.1170134 -0.1251388 -0.0570104 0.2305776 0.0674063 0.0108351 0.0886442 0.230859 -0.0521269 -0.0210644 -0.0019893 -0.074374 -0.096677 -0.1217957 -0.0356709 -0.1686685 -0.1497307 -0.0266844 0.0537696 -0.0286227 0.0411106 0.0396621 0.0466014 0.0270605 0.0386635 0.0386215 0.0093987 -0.0325316 0.0371933 -0.0455738 -0.1015682 0.1111854 0.0345178 0.0816886 0.0423724 -0.0023949 -0.0348457 -0.0866099 -0.0331833 0.0005849 -0.1125272 -0.0754607 -0.0900667 -0.0567529 0.0265597 0.0034552 0.0416296 -0.0789257 -0.0719963 -0.1466025 -0.0151131 -0.1070261 -0.1233376 -0.1364242 0.058903 -0.0517699 0.0918848 0.0444834 0.0094517 -0.0214181 -0.0125325 0.0889106 -0.0934693 0.0185676 0.0796201 0.1094043 0.0194255 -0.1104328 0.1012454 -0.0581911 -0.1069511 0.0132018 -0.0728944 0.0124812 -0.1201767 -0.111744 0.0093241 0.0046774 -0.0206856 0.0950004 0.0710674 -0.0725425 0.0233417 -0.0866813 -0.0666375 0.0529861 0.0269259 0.0967077 0.0459287 -0.0520112 0.0521588 0.1277507 0.0261637 0.0799349 -0.0356657 0.0990151 -0.0451004 0.0082342 -0.042034 0.0379166 -0.113897 0.0602879 0.0559455 0.0542925 -0.1125534 0.0279229 0.0431618 0.0259251 -0.050903 -0.0872852 -0.0880112 -0.0147244 -0.1017131 -0.1193953 -0.0814937 -0.0270139 0.0986647 -0.0765152 0.0309406 -0.0395613 -0.0448837 0.0871686 0.0022637 0.0987575 0.0376481 -0.078026 0.0768835 0.1030301 0.0921121 0.0627668 -0.0523466 0.1399991 -0.0705109 -0.0353304 unknown
polarizability: 81.3440926|2.9760697|64.5075691|0.9508498|1.5601983|63.1547878 unknown
InChI: InChI=1S/C6H12O2/c1-3-6(2)7-4-5-8-6/h3-5H2,1-2H3
charge 0 multiplicity 1
20 atoms
O  -0.869628 0.965943 -0.658638
O  -0.279306 -0.890662 0.713921
C  0.265042 0.360496 0.104081
C  1.385715 -0.041382 -0.871579
C  -1.925991 -0.063294 -0.753858
C  -1.748354 -0.847531 0.556933
C  0.663171 1.360415 1.19138
C  2.554025 -0.800397 -0.206768
H  1.751429 0.878504 -1.366181
H  0.927468 -0.672815 -1.655871
H  -1.766538 -0.711553 -1.638646
H  -2.88933 0.464499 -0.83929
H  -2.217552 -0.318683 1.410514
H  -2.103363 -1.889693 0.514377
H  1.000009 2.306838 0.733389
H  -0.202849 1.575057 1.839486
H  1.477508 0.953663 1.813864
H  3.110218 -0.159891 0.501524
H  2.176484 -1.67884 0.344656
H  3.270442 -1.151975 -0.970995
