program: Gaussian 09
title: 000061063
version: EM64L-G09RevD.01
frameworkgroup: C1[X(C18H22NO3)]
method: RPBEPBE
basis: SDD
operation: Freq
keyword: #p
keyword: freq=noraman
keyword: PBEPBE/SDD
title: #p freq=noraman PBEPBE/SDD
converged: YES YES NO NO
title: Mulliken charges:
elementType: O O O N C C C C C C C C C C C C C C C C C C H H H H H H H H H H H H H H H H H H H H H H
charge: -0.250484 -0.433172 -0.391877 -0.181687 0.234735 -0.242433 0.057714 -0.564543 -0.326483 0.003118 -0.382589 -0.611546 0.411078 -0.248016 -0.094175 0.071396 -0.596400 -0.602961 -0.226588 -0.426304 0.130246 -0.337498 0.251565 0.267351 0.272086 0.280854 0.276725 0.272125 0.276850 0.259404 0.242517 0.237414 0.241691 0.271111 0.270497 0.264110 0.264970 0.277353 0.268708 0.266004 0.247637 0.241508 0.378717 0.379273
chargesum: 1.00000
title: Mulliken charges with hydrogens summed into heavy atoms:
elementType: O O O N C C C C C C C C C C C C C C C C C C
charge: -0.250484 -0.054456 -0.012604 -0.181687 0.234735 0.009132 0.325066 -0.011603 -0.049758 0.003118 0.166386 -0.109625 0.411078 -0.010602 0.147516 0.071396 0.209318 0.208070 0.039416 -0.178667 0.130246 -0.095990
polarizability: 2.43667508e+02 4.44101044e+00 1.92055522e+02 -4.74009237e+00 1.64634494e+01 1.50950408e+02
1716.lowfreq: -13.3984 -10.6860 -0.0005 -0.0004 0.0003 7.1729 58.5922 71.3641 109.5080
frequency: 58.5410 71.3568 109.5020 125.8062 150.8168 164.3126 197.4748 220.8886 243.1291 255.7032 263.0625 270.5426 279.8396 293.2192 303.6096 329.5329 357.3615 383.8707 388.2025 391.5436 417.6429 434.2706 439.3849 446.0800 459.4832 495.3725 502.1419 524.4516 547.7184 552.4867 568.1836 584.1988 597.8434 625.8926 634.1162 664.4642 683.1000 707.5774 713.7279 749.4356 767.4350 794.3442 802.5466 835.0149 843.5725 869.3341 897.1989 904.6167 915.2085 923.4496 929.8866 951.3092 956.8269 967.2814 976.5262 988.1609 1001.2378 1038.1441 1046.5578 1063.6339 1090.2298 1100.0747 1109.5754 1122.6261 1145.4230 1149.0745 1153.8347 1169.6039 1179.9756 1197.0928 1202.4073 1209.0184 1215.7434 1217.2985 1224.6895 1233.8968 1245.9310 1253.6843 1268.3758 1277.2971 1280.9357 1311.9218 1314.0876 1334.5971 1338.3590 1355.4712 1363.0206 1378.8264 1415.1542 1429.5697 1440.2487 1443.3598 1460.7020 1461.5888 1468.1021 1470.7601 1477.5967 1482.1657 1487.2444 1495.0421 1563.6785 1616.2984 1635.4304 1642.1849 2971.4489 2993.9989 2995.0089 3009.9196 3020.3915 3025.4477 3028.7131 3045.8100 3054.0536 3075.5391 3084.5172 3118.4004 3124.3921 3130.9186 3132.5112 3136.1950 3140.4078 3151.9497 3154.0594 3158.5807 3489.0162 3581.1564
redmass: 5.5270 5.8745 3.2333 4.5196 3.3297 1.7258 1.5232 2.9624 3.3613 2.2605 1.7961 3.2168 2.8757 3.8083 3.5398 4.5479 3.2919 1.3957 2.1503 2.2827 4.3996 4.3454 1.6876 3.1145 2.2764 4.2801 3.1472 3.5904 4.3761 4.1687 3.9172 5.0898 3.7987 3.6695 3.3137 2.1567 3.3705 4.8748 3.8511 5.3312 3.0779 1.6688 2.9534 4.5357 2.4629 3.0747 3.3540 4.2987 1.8944 2.0619 3.3417 2.4604 3.0097 1.6950 1.9090 2.7083 3.1272 2.2907 4.6233 1.9093 1.3903 1.9528 1.9560 1.7162 1.6816 1.9375 1.4509 1.3623 1.6152 1.6653 1.6803 1.5757 1.6647 1.7148 1.4580 1.9319 1.6549 1.5864 1.5235 2.4321 1.4899 1.3106 1.3108 1.2933 1.2363 1.2975 1.5242 4.4512 1.1351 4.5018 1.1544 1.1350 1.0615 1.0574 1.0974 1.0875 1.0774 1.0542 1.0594 3.3385 5.7893 1.1292 7.7072 8.1622 1.0826 1.0720 1.0718 1.0596 1.0322 1.0343 1.0790 1.0634 1.0994 1.1027 1.0890 1.1080 1.0867 1.0883 1.1052 1.1048 1.1049 1.1031 1.0960 1.0989 1.0654 1.0665
irintensity: 1.4718 1.4300 0.4720 0.7245 0.7079 0.6487 0.4424 0.8103 6.5116 11.0801 6.7070 1.3010 1.7644 1.9266 1.0532 18.8775 3.3213 59.1837 13.5600 26.4661 9.2964 0.3273 79.6709 8.1918 24.4002 0.5182 3.5161 3.0213 2.2295 2.7310 4.0503 7.8135 19.1789 2.9470 7.5232 8.5794 6.4072 1.8765 2.9496 4.6430 54.8453 46.2282 34.7505 8.9543 10.9091 9.0333 25.5160 21.7894 25.1362 19.4073 1.4910 22.4531 10.5431 28.4668 21.5030 3.9465 58.0123 2.5553 55.6606 14.7703 17.0094 61.7024 46.1267 8.4657 16.6922 6.5608 28.2645 3.1023 49.6171 5.1163 53.9661 16.5304 5.7993 13.3683 9.5358 1.1479 11.5835 5.5110 5.2130 82.7160 15.7873 5.7373 0.6978 5.8449 1.7154 58.0294 13.1787 25.5036 14.4143 5.1582 11.3964 5.6413 21.0728 5.0728 29.1135 2.5798 40.4712 26.6237 26.9312 70.9992 35.2904 5.4932 2.1115 37.2789 16.3718 35.5830 13.5270 21.0285 3.4066 5.4689 2.5576 10.4964 4.5981 11.0039 18.0544 5.4890 3.6643 6.8427 1.1907 5.4592 4.1048 4.1615 5.4905 5.5713 27.0049 88.3960
temp: 298.150 k
press: 1.00000 atm
elementType: 8 8 8 7 6 6 6 6 6 6 6 6 6 6 6 6 6 6 6 6 6 6 1 1 1 1 1 1 1 1 1 1 1 1 1 1 1 1 1 1 1 1 1 1
symmnumber: 1
zpe: 967377.0 jmol-1
zpe.correction: 0.368454 hartree
zpe.thermalcorrener: 0.386858 hartree
zpe.thermalcorrenthalpy: 0.387802 hartree
zpe.thermalcorrgfe: 0.324916 hartree
zpe.sumelectzpe: -977.542988 hartree
zpe.sumelectthermal: -977.524584 hartree
zpe.sumelectthermalent: -977.523640 hartree
zpe.sumelectthermalfe: -977.586526 hartree
dipole: -12.5155 3.8148 -0.1912
dipole: 13.0853
quadrupole: -67.0554 -113.5230 -119.4954
quadrupole: 16.1610 7.1411 6.3734
quadrupole: 32.9692 -13.4984 -19.4708 16.1610 7.1411 6.3734
hfenergy: -977.9114421 hartree
pointgroup: C01 [X(C18H22N1O3)]
dipole: -4.8873311 -1.6171192 0.0502915 debye
polarizability: 244.0010618|-3.068805|188.2974147|1.5995488|20.2936012|154.3749609 unknown
InChI: InChI=1S/C18H22NO3/c1-19(2)8-7-18-11-4-6-14(21)17(18)22-16-13(20)5-3-10(15(16)18)9-12(11)19/h3-6,11-12,14,17,20-21H,7-9H2,1-2H3
charge 1 multiplicity 1
44 atoms
O  2.145463 0.769315 1.192406
O  2.577008 2.96934 -0.320366
O  4.176613 -1.169216 0.587365
N  -3.29456 -0.258383 0.246513
C  -0.256192 0.633988 0.713561
C  -1.165574 0.838208 -0.523103
C  -1.902017 -0.547286 -0.349093
C  -1.304679 0.504634 1.923422
C  0.914296 1.625005 0.946563
C  0.529263 -0.648568 0.257468
C  -2.836754 0.616542 1.527644
C  -1.334097 -1.644237 -1.261544
C  0.12054 -1.659376 -0.676072
C  -0.356473 1.15188 -1.765221
C  1.186156 2.539931 -0.298441
C  1.877506 -0.476547 0.582929
C  -3.949857 -1.550389 0.713986
C  -4.266995 0.50071 -0.639111
C  0.746745 1.93441 -1.630856
C  1.102419 -2.58998 -1.081305
C  2.864284 -1.411805 0.193594
C  2.440047 -2.491504 -0.62283
H  -1.866038 1.680655 -0.36679
H  -1.52271 -0.985395 0.583561
H  -1.150259 1.343677 2.629952
H  -1.121785 -0.416034 2.50663
H  0.825054 2.241025 1.854091
H  -3.469851 0.278694 2.365569
H  -3.109205 1.655625 1.286488
H  -1.332369 -1.407763 -2.33888
H  -1.82088 -2.627345 -1.12066
H  -0.678846 0.787096 -2.747347
H  0.606856 3.473972 -0.142627
H  -4.164368 -2.184015 -0.160086
H  -3.266106 -2.079342 1.395975
H  -4.887763 -1.311825 1.238816
H  -5.149497 0.789832 -0.046982
H  -3.781019 1.398842 -1.044618
H  -4.575153 -0.154295 -1.469167
H  1.350593 2.234326 -2.495123
H  0.840506 -3.392783 -1.778583
H  3.175819 -3.233738 -0.955772
H  3.140194 2.217639 0.011211
H  4.800584 -1.856319 0.24333
