program: Gaussian 16
title: Title Card Required
version: ES64L-G16RevC.02
method: RB3LYP
basis: 6-31G(d)
operation: Freq
keyword: #P
keyword: Geom=AllCheck
keyword: Guess=TCheck
keyword: SCRF=Check
keyword: Test
keyword: GenChk
keyword: RB3LYP/6-31G(d)
keyword: Freq
converged: YES YES NO YES
title: Mulliken charges:
elementType: C H H C O O C H H C O O C H H C O O H O P O O O P O O O P O O O C H H Mg O H H O H H O H H H H H H
charge: -0.542398 0.146010 0.183300 0.579900 -0.536470 -0.599597 -0.524534 0.151349 0.130885 0.614176 -0.564149 -0.623645 -0.577559 0.146602 0.187121 0.586138 -0.603063 -0.645792 0.452210 -0.715192 1.100469 -0.715610 -0.738992 -0.666337 1.249804 -0.727854 -0.673294 -0.684757 1.207071 -0.692312 -0.655887 -0.557743 -0.236133 0.178263 0.142150 0.545919 -0.933480 0.403785 0.428187 -0.842934 0.441892 0.487230 -0.840128 0.447822 0.449187 0.137470 0.179375 0.131947 0.189601
chargesum: -4.00000
polarizability: 2.44107595e+02 2.10239226e+01 2.47988311e+02 2.54491784e+00 -8.26860210e+00 2.46552322e+02
frequency: 19.5948 34.5670 40.9946 46.0342 47.0267 51.1772 61.5932 68.7208 77.7383 81.0899 87.4910 98.6628 101.6717 108.1288 121.1555 127.1791 136.9564 141.0234 148.8577 158.8765 166.0547 171.7366 186.9114 208.3900 214.0411 221.6922 224.7713 237.4734 260.3676 270.9537 287.8600 299.2686 302.6706 340.1285 345.9935 363.2282 371.2527 376.6744 387.5297 390.7471 412.5336 430.7783 448.5298 463.9806 466.5449 472.5859 491.7216 502.9310 510.0850 526.1878 527.3011 542.1203 566.7887 569.9733 575.6813 609.6437 631.7626 645.0857 660.9214 680.2558 701.9819 707.2914 747.9047 754.7464 755.6384 776.2631 786.0691 813.1242 824.8617 826.5045 848.3377 857.9096 897.0576 934.6286 973.9366 1047.0237 1065.3450 1075.7387 1084.8554 1103.3668 1116.3766 1131.6209 1133.3195 1171.1381 1183.7814 1192.8298 1194.0177 1231.5505 1234.2019 1267.5508 1278.0852 1289.2535 1368.8715 1423.2652 1428.6216 1434.7232 1444.0932 1446.8274 1498.0665 1637.8582 1688.3337 1717.2914 1751.1436 1770.6599 1774.8614 2705.1161 2943.4318 2953.5112 2962.9156 2995.2550 2996.8747 3001.1890 3003.5504 3027.0015 3071.8933 3134.9075 3227.1496 3723.4253 3728.4354 3797.5469
redmass: 17.2005 14.0705 9.0824 12.3191 7.6878 10.6626 10.8557 12.4322 11.0983 11.8511 10.9544 9.8565 7.4405 15.4906 5.8305 8.8445 10.1807 10.2804 13.9688 12.2179 10.3056 10.5938 12.0013 8.0066 11.0278 10.9818 7.5006 9.5823 15.9581 15.4856 15.4894 7.2483 12.3163 15.6879 15.9723 7.9503 14.2924 6.8499 13.5456 1.8417 4.9306 8.9340 5.6061 15.2760 4.4211 1.3844 7.4045 8.9536 7.4663 2.0613 2.0879 14.9961 1.5018 1.6525 2.5079 1.3145 1.1612 12.6100 5.3281 1.2444 1.4673 13.4926 2.4491 2.1287 1.3292 4.3301 2.1174 1.0885 6.1486 8.0194 3.4972 1.3843 9.9967 14.9601 15.5897 3.2489 1.5906 1.1372 16.3561 14.9078 1.0760 1.1196 1.0589 1.0928 1.1804 2.9175 1.5623 6.9601 1.1668 2.2991 1.7626 2.2279 9.3579 1.6941 1.5828 2.0936 1.0268 1.0403 1.0249 9.6768 6.2725 1.0758 1.2277 1.0798 5.9763 1.0882 1.0080 1.0081 1.0079 1.0080 1.0081 1.0080 1.0081 1.0080 1.0708 1.0682 1.0653 1.0643 1.0646 1.0644
irintensity: 19.6016 18.9126 18.6797 10.5853 20.5361 8.2395 5.8128 9.7196 11.1692 43.9812 8.5411 50.6541 6.4180 17.0792 9.3785 12.6392 12.9690 9.4136 15.1247 3.2923 8.8187 2.1407 16.4154 13.4214 3.8566 12.1198 1.0418 8.8079 8.7196 0.0600 7.5329 8.6872 7.9103 7.1452 3.9724 5.9572 8.8558 25.6466 5.8732 78.8042 39.1668 36.7288 5.5354 154.2190 74.0004 17.0665 328.8380 74.0119 168.6628 38.5287 135.0924 234.6012 64.2789 26.0835 45.8582 10.0011 72.3886 246.0143 207.6886 262.7008 4.7082 81.0223 20.0114 20.5568 12.0007 101.2390 12.5042 200.2368 77.8670 71.3242 549.4300 569.1080 97.1523 459.5443 19.2090 529.1905 53.9496 79.3894 292.6703 578.5152 9.3870 61.9559 7.5781 18.0132 136.8625 183.0488 123.5763 389.3267 67.6728 281.7452 254.8044 991.7174 219.1407 165.5883 6.4625 170.1948 49.6160 4.9570 7.3045 740.3654 804.4370 97.4944 155.1319 172.7744 537.0388 3046.9777 52.1718 36.5369 21.4232 5.0454 17.2816 43.7792 22.8878 19.4733 1323.5987 1357.3367 1376.6661 139.5556 175.8551 46.6357
temp: 298.150 k
press: 1.00000 atm
elementType: 6 1 1 6 8 8 6 1 1 6 8 8 6 1 1 6 8 8 1 8 15 8 8 8 15 8 8 8 15 8 8 8 6 1 1 12 8 1 1 8 1 1 8 1 1 1 1 1 1
symmnumber: 1
zpe: 704509.7 jmol-1
zpe.correction: 0.268334 hartree
zpe.thermalcorrener: 0.301067 hartree
zpe.thermalcorrenthalpy: 0.302012 hartree
zpe.thermalcorrgfe: 0.202647 hartree
zpe.sumelectzpe: -2932.295019 hartree
zpe.sumelectthermal: -2932.262285 hartree
zpe.sumelectthermalent: -2932.261341 hartree
zpe.sumelectthermalfe: -2932.360706 hartree
dipole: 3.5144 13.2031 8.9611
dipole: 16.3393
quadrupole: -328.9723 -304.9374 -344.1533
quadrupole: -18.8824 40.8694 26.1187
quadrupole: -2.9513 21.0836 -18.1323 -18.8824 40.8694 26.1187
hfenergy: -2932.5633528 hartree
pointgroup: C01 [X(C7H19Mg1O19P3)]
dipole: 1.3097233 4.4746788 2.8487914 debye
polarizability: 244.1075953|21.0239226|247.9883111|2.5449178|-8.2686021|246.5523222 unknown
InChI: InChI=1/C2H4O2.2C2H3O2.CH3O10P3.Mg.3H2O/c3*1-2(3)4;1-9-13(5,6)11-14(7,8)10-12(2,3)4;;;;/h3H,1H3;2*1H3;1H3;;3*1H2/q;;-1;-3;+4;;;/rC3H10MgO14P3.C2H4O2.C2H3O2.H2O/c1-3(5)13-4(6,7)14-19(8,9)17-21(11,16-4)18-20(10,12-2)15-4;2*1-2(3)4;/h6-7H2,1-2H3;3H,1H3;1H3;1H2
charge -4 multiplicity 1
49 atoms
C  -3.53454562 -4.50871582 0.28064313
H  -4.27824648 -5.26653078 0.54685014
H  -2.53107959 -4.82818433 0.56942192
C  -3.90211954 -3.18628935 0.93787764
O  -5.03303771 -2.72088665 0.92422643
O  -2.85412636 -2.59570113 1.50338172
C  3.00129017 0.13240228 3.54760665
H  2.39203256 0.19191315 4.45987247
H  4.01784348 0.44888282 3.7997085
C  2.39706381 1.0713903 2.50305003
O  1.29091567 0.72337142 1.98548039
O  3.01172017 2.14957887 2.26996335
C  -1.66752946 0.88247375 4.2445123
H  -2.08940963 1.89417497 4.18794001
H  -0.72659634 0.86684782 3.68474731
C  -2.65699567 -0.14782176 3.67057895
O  -3.28470908 -0.88160792 4.45119662
O  -2.76028993 -0.16627328 2.382333
H  -3.03014609 -1.64444298 1.85382646
O  -0.41613524 -2.81755754 -1.76002531
P  0.46760216 -2.00035789 -0.84144785
O  -0.16715584 -0.66524113 -0.36036285
O  1.20895283 -2.7643308 0.26322861
O  1.79141556 -1.47432721 -1.86044784
P  2.2135143 0.0151075 -2.25967437
O  2.21619378 0.94506851 -1.03526027
O  3.45049069 -0.01515195 -3.11039502
O  0.9432326 0.49549838 -3.23542484
P  -0.16971675 1.69153874 -3.09978331
O  -0.34189966 2.09613999 -1.64140648
O  -1.35320526 1.35097778 -3.94836936
O  0.59882503 2.93655833 -3.87108709
C  1.71836817 3.54442486 -3.23137093
H  2.37554977 2.80704989 -2.76087281
H  1.39298708 4.26474647 -2.4692907
Mg 0.44762397 1.18940923 0.06956096
O  -0.40045082 -4.28215895 1.84225739
H  -1.15275749 -3.66952527 1.90849882
H  0.21341559 -3.77399062 1.23903545
O  -1.27718275 1.76337634 1.18753114
H  -0.84951005 2.12858791 1.97692049
H  -1.81410956 0.99160166 1.54336901
O  1.39333637 3.16951366 0.42449811
H  2.05269499 2.87689447 1.12749667
H  1.86563816 3.01074174 -0.41237998
H  -1.46435074 0.637556 5.26625327
H  3.01193214 -0.8964925 3.25425591
H  2.26357826 4.0531085 -3.99876058
H  -3.56560989 -4.3733583 -0.78035872
