program: Gaussian 16
title: Title Card Required
version: ES64L-G16RevC.02
method: RB3LYP
basis: 6-31G(d)
operation: Freq
keyword: #P
keyword: Geom=AllCheck
keyword: Guess=TCheck
keyword: SCRF=Check
keyword: Test
keyword: GenChk
keyword: RB3LYP/6-31G(d)
keyword: Freq
converged: YES YES YES YES
title: Mulliken charges:
elementType: C H H C O O C H H C O O C H H C O O H O P O O O P O O O P O O O C H H Mg O H H O H H O H H H H H H
charge: -0.510875 0.142601 0.207133 0.591301 -0.504993 -0.623335 -0.527587 0.138954 0.124658 0.620142 -0.596114 -0.610356 -0.579435 0.168437 0.192884 0.582224 -0.564848 -0.661140 0.427185 -0.705871 1.154689 -0.732650 -0.686312 -0.717455 1.133442 -0.753782 -0.749471 -0.690036 1.186923 -0.701967 -0.680521 -0.569229 -0.250266 0.195549 0.136196 0.508923 -0.825462 0.425711 0.502892 -0.813456 0.470236 0.468102 -0.852051 0.436328 0.457402 0.158781 0.187744 0.115705 0.173073
chargesum: -4.00000
polarizability: 2.54800539e+02 5.74639814e+00 2.52069202e+02 6.11783377e-01 4.37257871e+00 2.41748427e+02
frequency: -589.4972 17.6842 41.2139 51.4338 56.2460 61.5449 63.5446 69.0943 72.6660 77.8180 82.5519 89.5290 95.1072 102.1678 110.9962 118.5684 124.1690 140.5705 155.8509 157.6946 164.9160 168.2331 181.2957 190.0459 195.3143 216.3525 228.5262 245.9965 248.9465 250.8741 268.4796 288.1627 302.8565 310.4344 339.5737 352.0976 365.9025 385.2074 400.2999 409.8294 412.4790 421.0516 434.3706 435.9069 475.2936 480.0406 494.4146 514.2623 519.7223 522.3171 526.3022 550.1109 551.4818 579.1129 629.3219 635.9951 661.9679 672.5251 676.3342 705.3927 714.8168 743.4577 746.7973 751.1134 758.7033 767.2346 768.0731 810.4519 834.4141 871.4607 881.1606 902.3797 919.1943 965.4194 981.6031 1003.9442 1029.7822 1057.8430 1106.5379 1123.3944 1128.2048 1144.8701 1150.5592 1172.5204 1193.0587 1196.3287 1213.9694 1229.9252 1235.5407 1244.0077 1258.2251 1309.2535 1328.4961 1395.6561 1400.9001 1411.0193 1417.4257 1431.9591 1462.3860 1493.3999 1637.1193 1721.9828 1734.5830 1747.8816 1777.3739 1811.9013 2946.3070 2953.2607 2964.3160 2991.2439 2992.1703 3004.8267 3038.4987 3064.9644 3252.9973 3355.0401 3483.7989 3556.4932 3642.6399 3687.9234
redmass: 1.5043 16.6468 12.7538 13.0091 14.2575 14.7083 11.1534 13.6645 12.7594 12.2318 10.2246 11.3165 13.0831 10.8745 11.6119 11.5961 9.8165 9.2233 15.3068 8.4847 11.5231 12.4657 11.0796 9.6373 12.4584 10.7973 6.9996 11.5120 8.4202 15.5818 13.6727 12.2394 15.8005 4.6569 17.0494 12.6198 10.3394 13.0968 1.3809 6.9361 8.4419 3.2593 7.6229 6.5882 15.2931 10.8429 15.2580 8.3519 9.4297 15.7392 1.6733 3.4086 5.7535 1.3284 13.7052 1.1896 3.2221 1.7299 8.3634 1.9122 1.1200 2.9073 1.9571 3.8310 1.5293 1.3338 1.2910 2.0107 2.3959 4.5824 3.1254 6.9947 1.3810 8.4103 4.9404 1.2747 1.5265 16.6722 9.5148 1.0758 1.0941 1.0759 6.3695 1.0719 1.7366 1.0975 18.2356 1.6156 17.0797 10.3025 1.0648 1.2169 1.0346 1.1433 2.9704 1.4758 8.0390 1.0519 1.0201 1.0291 7.7880 1.0916 2.1081 1.0908 1.8019 7.4332 1.0081 1.0080 1.0079 1.0080 1.0080 1.0080 1.0079 1.0080 1.0674 1.0671 1.0644 1.0512 1.0753 1.0642
irintensity: 4274.4649 17.5437 9.7313 8.1348 5.3381 31.3382 7.0784 12.6278 9.8808 47.9767 31.4207 32.0703 17.7484 6.8837 14.4287 27.2441 4.0418 38.4269 6.6740 3.1156 3.8824 26.3593 40.2203 48.3514 26.8120 8.1562 1.2129 11.3910 4.7623 8.9882 11.5345 0.1421 0.2681 13.3902 5.8832 35.3833 5.7824 8.3987 103.0423 52.6824 14.2035 16.1674 7.6251 41.6665 40.0493 135.3866 88.4415 129.4253 95.7343 92.7428 14.0718 49.3304 21.8939 77.4098 212.0110 4.5437 265.3116 99.4836 65.2445 49.3847 93.4957 53.2781 108.5879 3.5458 251.1599 502.3481 445.7393 191.0682 124.1657 482.4887 733.9198 488.3673 421.6428 91.8282 217.9755 141.4492 369.4239 335.3742 435.9403 17.1572 23.4613 25.5144 439.3265 27.8608 254.8397 32.8082 415.0320 210.8246 541.3479 615.7488 11.6672 153.0557 12.8613 21.2819 274.1539 83.4256 352.3242 17.4301 36.8532 9.0877 662.7370 165.8515 177.3055 157.4146 259.3238 361.9588 46.9573 42.3780 37.1541 55.8964 46.0719 16.6262 0.9691 9.7596 1086.4604 939.4211 433.2776 221.9555 327.3688 173.4593
temp: 298.150 k
press: 1.00000 atm
elementType: 6 1 1 6 8 8 6 1 1 6 8 8 6 1 1 6 8 8 1 8 15 8 8 8 15 8 8 8 15 8 8 8 6 1 1 12 8 1 1 8 1 1 8 1 1 1 1 1 1
symmnumber: 1
zpe: 699941.1 jmol-1
zpe.correction: 0.266593 hartree
zpe.thermalcorrener: 0.298584 hartree
zpe.thermalcorrenthalpy: 0.299529 hartree
zpe.thermalcorrgfe: 0.202316 hartree
zpe.sumelectzpe: -2932.239907 hartree
zpe.sumelectthermal: -2932.207916 hartree
zpe.sumelectthermalent: -2932.206972 hartree
zpe.sumelectthermalfe: -2932.304185 hartree
dipole: -1016.9952 -1288.7674 -1173.6224
dipole: 2018.0659
quadrupole: -54177.7821 -86724.2291 -72023.4152
quadrupole: -68220.5116 -62079.1949 -78711.8810
quadrupole: 16797.3600 -15749.0869 -1048.2731 -68220.5116 -62079.1949 -78711.8810
hfenergy: -2932.5065008 hartree
pointgroup: C01 [X(C7H19Mg1O19P3)]
dipole: -2.764602 -0.215948 7.2455482 debye
polarizability: 254.8005393|5.7463981|252.0692022|0.6117834|4.3725787|241.7484266 unknown
InChI: InChI=1/C2H5O6P.C2H4O2.C2H3O2.CH3O7P2.Mg.2H2O/c1-2(3)7-10-8-9(4,5)6;2*1-2(3)4;1-7-10(5,6)8-9(2,3)4;;;/h8H,1H3;3H,1H3;1H3;1H3;;2*1H2/q-1;;-1;-2;+4;;/rC5H15MgO17P3.C2H4O2/c1-4(7)17-6(9,10,20-25(13,14)23-27-18-5(2)8)19-24(11,12)22-26(15,16-3)21-6;1-2(3)4/h23H,9-10H2,1-3H3;3H,1H3
charge -4 multiplicity 1
49 atoms
C  49.15625 62.47615 62.17935
H  48.50423951 61.64243463 62.47140079
H  50.18322412 62.28136547 62.48440315
C  48.6678941 63.75308315 62.81519703
O  48.02555521 64.61395868 62.24599813
O  48.98426048 63.83951631 64.13008242
C  55.69205 67.1173 65.4460
H  55.05218439 67.16899673 66.33814469
H  56.70625227 67.40465766 65.74156254
C  55.15629235 68.11870472 64.41875604
O  53.94274651 67.98854199 64.0459904
O  55.93265588 69.03919026 64.05509508
C  51.0233 67.8672 66.1433
H  50.97742205 68.95765267 66.06972435
H  51.84732166 67.49289153 65.53439078
C  49.65996586 67.28797726 65.76347653
O  48.63636473 67.70068382 66.30741851
O  49.6598499 66.348089 64.84819977
H  48.82532268 64.77551132 64.42385612
O  51.66467138 63.95957657 62.07960801
P  52.46407058 65.0378551 62.78330075
O  52.08608978 66.48669603 62.37138225
O  53.89604243 64.75827636 63.15531734
O  55.04964482 65.55780356 59.4307404
P  55.06310278 67.07009709 59.4935904
O  54.79543345 67.66668845 60.921634
O  56.19089467 67.80345597 58.78039374
O  53.62172179 67.50624659 58.61380188
P  52.50868277 68.65211792 58.78961218
O  52.26106587 68.93638155 60.28075904
O  51.31863435 68.35904794 57.92162055
O  53.20548236 69.99964365 58.10905364
C  54.4092 70.52925 58.66735
H  55.06745423 69.73406607 59.02939926
H  54.18687088 71.23012734 59.48192826
Mg 53.13855 68.1742 61.9682
O  51.61346615 65.00427449 64.43619355
H  51.11649059 64.16495589 64.40146253
H  50.72927162 65.78859074 64.59653154
O  51.54411282 68.98602058 63.26684124
H  52.2169649 68.91601381 63.97449476
H  51.18982836 68.07038024 63.21781282
O  54.43980485 70.0467705 62.04505034
H  54.99976399 69.8127804 62.83690339
H  54.85405229 69.48988824 61.3442911
H  51.22645 67.6223 67.16495
H  55.70275 66.08825 65.15315
H  54.9544 71.0379 57.8999
H  49.1252 62.61135 61.1183
