program: Gaussian 09
title: 000061056
version: EM64L-G09RevD.01
frameworkgroup: C1[X(C12H26O)]
method: RPBEPBE
basis: SDD
operation: Freq
keyword: #pfreq=noraman
keyword: PBEPBE/SDD
title: #p freq=noraman PBEPBE/SDD
converged: YES YES NO NO
title: Mulliken charges:
elementType: O C C C C C C C C C C C C H H H H H H H H H H H H H H H H H H H H H H H H H H
charge: -0.457194 -0.015810 -0.447782 -0.416817 -0.066266 -0.434572 -0.038055 -0.029997 -0.765868 -0.718928 -0.717565 -0.729388 -0.694412 0.195724 0.192276 0.213533 0.192523 0.193861 0.203996 0.217576 0.194279 0.205008 0.191515 0.223932 0.220289 0.213327 0.212266 0.208369 0.215895 0.213032 0.213067 0.206246 0.208729 0.212818 0.213433 0.206446 0.190939 0.243860 0.329715
chargesum: 0.00000
title: Mulliken charges with hydrogens summed into heavy atoms:
elementType: O C C C C C C C C C C C C
charge: -0.127479 0.179913 -0.041972 -0.030433 0.137729 -0.022717 0.166952 0.161519 -0.108319 -0.082397 -0.085220 -0.094408 -0.053167
polarizability: 1.64222052e+02 1.96739023e-01 1.22220476e+02 -4.94419232e-01 6.22653048e-01 1.18189463e+02
1716.lowfreq: -16.8166 -0.0007 -0.0005 -0.0003 3.9068 11.8902 22.0699 23.4121 48.9744
frequency: 17.4092 21.9711 48.8555 54.4377 75.6819 94.9597 128.2353 165.0239 196.1750 205.1067 210.8854 220.1933 236.2696 239.0361 249.1170 288.7922 295.7148 333.0985 342.5234 360.1009 385.2620 410.3148 417.6807 437.5621 468.6353 524.1140 590.4029 767.8908 793.1470 817.3360 819.9398 848.4355 872.3547 912.9271 913.9216 919.0103 939.7829 952.9176 954.9353 962.6466 979.0811 1003.6191 1029.3059 1037.6645 1088.5179 1095.6910 1123.4374 1146.7229 1149.0271 1169.5783 1177.5060 1192.2269 1206.8957 1221.4565 1247.2668 1260.6304 1272.5950 1285.8260 1305.1016 1323.1639 1325.4804 1331.1796 1336.0832 1346.1723 1354.2775 1360.4228 1375.6648 1376.2127 1387.8661 1388.6796 1392.6240 1394.4794 1437.0901 1446.5163 1457.8249 1462.5021 1467.1623 1468.8547 1469.9983 1475.8235 1481.4609 1482.7182 1484.9773 1488.7045 1489.0439 2939.5268 2943.5733 2943.9940 2952.5341 2957.6076 2965.0569 2965.4999 2966.9710 2968.9864 2969.8693 2971.3589 2977.6326 3002.6262 3019.6680 3030.7583 3057.1716 3058.2535 3060.1460 3064.1968 3064.5099 3066.1976 3066.8004 3069.5044 3071.3498 3094.6367 3547.1108
redmass: 2.5565 3.7412 3.5966 2.5237 3.3675 2.1906 1.8538 2.9646 1.8588 1.1823 1.3949 1.3452 1.3635 1.0723 1.7773 1.1191 2.3690 2.2898 2.2558 2.1703 2.1197 2.1386 2.2870 2.1368 2.1447 2.6933 2.4521 3.1305 2.5665 2.5043 2.3331 1.5850 1.4731 1.2389 1.2310 1.8572 1.4474 2.0711 1.4127 1.5993 1.7830 1.9548 1.6369 1.9023 1.8223 1.9939 1.8606 2.1616 2.2334 2.0910 1.8015 1.7693 1.4592 1.3214 1.2913 1.3480 1.1435 1.2988 1.3374 1.4457 1.4698 1.4121 1.3706 1.4605 1.3499 1.2590 1.2184 1.2242 1.3762 1.3869 1.2191 1.2286 1.0913 1.0871 1.0828 1.0477 1.0503 1.0515 1.0531 1.0574 1.0532 1.0483 1.0484 1.0522 1.0516 1.0690 1.0710 1.0776 1.0814 1.0608 1.0355 1.0791 1.0416 1.0363 1.0546 1.0396 1.0423 1.1009 1.1010 1.1002 1.0993 1.0987 1.0996 1.0991 1.0995 1.0989 1.0989 1.0987 1.0980 1.0985 1.0656
irintensity: 0.2129 0.0901 0.2510 0.4987 0.1059 0.2614 5.2523 0.0849 0.2308 1.2874 2.6140 7.2248 2.5988 0.3802 1.0375 133.1655 1.5635 1.0186 3.2326 1.5173 0.6149 2.6432 5.8582 0.3522 3.6158 1.1148 10.8515 0.3168 11.2548 6.2669 9.1131 2.5019 1.5249 3.5869 5.1514 3.1153 3.2795 9.1023 0.1235 1.4758 9.5436 43.8689 8.2389 0.5874 2.5832 3.6627 2.4711 6.8321 14.7863 8.0098 10.9621 7.2608 7.4944 26.4068 13.7859 8.2762 13.0301 1.2178 1.7221 5.4330 3.6676 1.8233 3.2813 3.2527 3.0616 7.1509 21.0642 19.6767 14.7142 7.1338 16.9942 18.7505 0.6166 3.3277 0.9481 3.9520 2.3995 2.9831 10.6018 3.7809 7.5503 18.9635 6.0605 27.2093 23.3321 9.5988 17.0321 38.2153 13.6511 9.5789 42.3596 1.9960 55.0873 25.8701 83.3112 37.7120 27.2265 30.9532 12.7476 78.7566 3.8661 42.5679 42.0884 26.8404 59.1596 72.3032 91.8399 81.0523 40.3329 37.0502 2.9276
temp: 298.150 k
press: 1.00000 atm
elementType: 8 6 6 6 6 6 6 6 6 6 6 6 6 1 1 1 1 1 1 1 1 1 1 1 1 1 1 1 1 1 1 1 1 1 1 1 1 1 1
symmnumber: 1
zpe: 933598.5 jmol-1
zpe.correction: 0.355589 hartree
zpe.thermalcorrener: 0.373533 hartree
zpe.thermalcorrenthalpy: 0.374477 hartree
zpe.thermalcorrgfe: 0.308526 hartree
zpe.sumelectzpe: -546.980591 hartree
zpe.sumelectthermal: -546.962648 hartree
zpe.sumelectthermalent: -546.961703 hartree
zpe.sumelectthermalfe: -547.027655 hartree
dipole: 1.6007 -1.2528 0.5531
dipole: 2.1066
quadrupole: -88.3733 -87.3483 -84.5946
quadrupole: 4.0560 0.9442 1.6076
quadrupole: -1.6012 -0.5763 2.1775 4.0560 0.9442 1.6076
hfenergy: -547.3361803 hartree
pointgroup: C01 [X(C12H26O1)]
dipole: 0.6309221 0.5213539 -0.1305234 debye
polarizability: 164.2106764|-0.2844667|121.9207915|0.8533938|1.2247396|118.5005227 unknown
InChI: InChI=1S/C12H26O/c1-9(2)6-11(5)8-12(13)7-10(3)4/h9-13H,6-8H2,1-5H3
charge 0 multiplicity 1
39 atoms
O  -1.397204 -1.442208 -0.42442
C  1.244112 0.04895 -0.261569
C  -0.009751 0.374232 0.596052
C  2.520677 0.40866 0.548253
C  -1.374751 -0.013414 -0.024669
C  -2.518578 0.186226 0.987212
C  3.887881 0.079676 -0.111128
C  -3.976407 0.185586 0.441195
C  1.211444 0.766218 -1.633474
C  4.032361 -1.424815 -0.444063
C  5.039936 0.54143 0.813832
C  -4.19621 1.257034 -0.655495
C  -4.44346 -1.207372 -0.045901
H  1.2629 -1.049117 -0.436244
H  -0.024828 1.464899 0.804328
H  0.086484 -0.141173 1.574061
H  2.492943 1.496227 0.776554
H  2.47519 -0.1156 1.527129
H  -1.554774 0.617223 -0.922063
H  -2.417513 -0.603452 1.758713
H  -2.34067 1.156855 1.495537
H  3.968712 0.652559 -1.058373
H  -4.617779 0.466705 1.305067
H  2.080054 0.48678 -2.256308
H  0.301695 0.520438 -2.212151
H  1.231968 1.865147 -1.498528
H  5.033706 -1.641124 -0.860919
H  3.906227 -2.039822 0.468407
H  3.283214 -1.760766 -1.184227
H  6.026097 0.361768 0.346503
H  4.963114 1.620901 1.043833
H  5.015719 -0.010721 1.773534
H  -3.84028 2.253439 -0.329845
H  -3.665055 0.991058 -1.588749
H  -5.270412 1.34428 -0.903508
H  -4.344055 -1.96203 0.756094
H  -5.504418 -1.174535 -0.360117
H  -3.827784 -1.552436 -0.893442
H  -0.658504 -1.601505 -1.06601
