program: Gaussian 16
title: Molecule Name
version: ES64L-G16RevC.02
method: RB3LYP
basis: 6-31G(d)
operation: Freq
keyword: #P
keyword: Geom=AllCheck
keyword: Guess=TCheck
keyword: SCRF=Check
keyword: Test
keyword: GenChk
keyword: RB3LYP/6-31G(d)
keyword: Freq
converged: YES YES NO YES
title: Mulliken charges:
elementType: C C O O H H C C O O H H C C O O H H H P P P C O O O O O O O O O O H H Mg O H H O H H O H H H H H H
charge: -0.515589 0.591631 -0.618939 -0.536667 0.135912 0.154504 -0.525657 0.630605 -0.572540 -0.622426 0.154453 0.162374 -0.545324 0.591387 -0.617720 -0.612417 0.153810 0.176067 0.431730 1.232194 1.141362 1.077958 -0.227547 -0.569350 -0.715507 -0.768145 -0.684003 -0.677131 -0.749445 -0.675104 -0.690048 -0.721641 -0.688478 0.199325 0.125113 0.522799 -0.844529 0.431133 0.460768 -0.830561 0.477479 0.471636 -0.855941 0.472403 0.443860 0.108513 0.170483 0.138543 0.208667
chargesum: -4.00000
polarizability: 2.55674237e+02 -1.23988450e+01 2.40463699e+02 7.43719625e+00 2.52296119e+00 2.48223751e+02
frequency: 18.8960 23.9672 35.1235 44.8081 57.5877 60.3292 64.9194 73.8269 77.7248 81.6820 84.6844 95.7741 110.1114 121.6149 126.3142 134.8152 141.4347 153.8772 160.2130 168.0184 187.0789 189.5716 200.6546 203.7666 214.5030 226.7014 237.3028 245.5006 257.0178 267.1390 279.9959 300.5744 318.6386 330.1131 345.5658 352.8140 370.8761 386.3956 391.4310 417.8644 433.8499 445.8424 469.3614 474.1197 479.5669 490.8765 495.5301 503.6356 506.3094 517.1000 532.3814 549.5055 557.0400 566.1316 601.7905 611.6890 650.4135 653.6778 688.0337 710.7065 731.1281 760.5220 761.8714 768.4437 774.3783 823.8250 829.8617 847.8059 851.9741 890.6672 929.3280 947.3141 976.5479 987.5728 1027.2438 1055.2935 1059.6829 1106.2837 1130.1030 1130.8154 1140.2879 1147.0299 1151.0598 1196.1327 1199.1139 1210.3450 1212.7024 1242.6404 1245.3700 1265.2300 1277.2741 1309.4812 1407.9077 1415.9158 1423.8019 1431.9682 1436.7009 1456.5655 1479.0793 1623.8793 1630.4728 1698.8920 1727.7218 1761.2109 1781.5818 2948.5376 2949.6168 2954.8617 2971.8673 2979.7595 3010.3049 3018.9064 3027.2410 3030.1458 3069.4794 3255.2009 3312.4694 3425.6643 3473.0250 3582.7951
redmass: 16.6206 16.3140 12.3302 10.4256 12.9274 13.9755 14.0049 12.0348 14.7696 11.6481 13.9776 11.7644 11.2877 11.7009 12.5097 10.6310 12.7726 12.5202 12.2226 14.4503 13.4037 9.4160 8.2771 8.8057 11.4696 13.4734 7.4702 9.4308 8.7822 11.8375 13.7294 7.0944 15.6040 8.4259 16.8822 10.8333 10.0390 7.9489 12.3699 7.8994 11.1306 6.7837 10.5804 5.0770 10.9533 14.4461 1.9203 5.7111 8.3536 14.3994 11.4746 2.0676 1.8829 1.5367 1.1154 1.1010 17.1428 1.2589 7.7878 1.0936 3.3430 2.9796 1.1394 4.0866 2.4711 1.8297 5.6924 1.5039 5.1954 7.2305 2.5428 1.4587 2.4994 14.7224 1.1305 15.4143 1.1482 6.6108 1.1818 1.0419 1.0313 1.1577 1.1599 3.8670 1.2713 1.0876 15.0753 12.2321 1.1046 8.3790 2.5934 1.0380 5.7917 1.1615 1.5055 1.0844 1.1191 5.4847 1.0329 4.6821 5.9659 1.0896 1.2152 1.1381 8.2076 1.0081 1.0080 1.0080 1.0084 1.0080 1.0326 1.0503 1.0080 1.0081 1.0718 1.0649 1.0641 1.0585 1.0722 1.0682
irintensity: 11.9940 19.2676 0.8336 13.6717 4.9918 8.0160 8.1529 13.2968 25.0319 22.2488 32.1336 6.5042 19.7533 5.7325 9.3738 10.8355 4.1939 6.9109 17.5405 26.9844 9.6138 13.7883 33.5976 21.8216 13.4433 14.2121 1.6690 30.1105 7.5831 10.4449 0.5978 39.1775 3.3378 52.2072 2.0515 17.7213 16.0219 2.0652 6.4011 70.8985 41.2057 33.6106 30.7199 6.4511 109.9912 28.2668 29.0218 26.2722 214.4361 318.4703 130.9535 74.8954 20.4498 96.6842 45.4608 126.7534 181.2968 1.7268 65.5474 324.7144 17.3362 36.9759 1.6914 50.3729 23.2430 39.0442 90.2725 222.2991 409.4874 463.5653 706.2037 65.0317 30.6471 81.6710 192.5303 340.2161 32.1260 491.8386 47.8578 10.2079 2.7148 42.9474 101.6971 403.6032 68.0328 30.1949 382.3916 535.0981 36.0269 289.6846 602.5885 11.4757 328.2919 150.9876 23.5341 2.4920 48.0844 305.8195 9.9135 891.6628 859.8278 78.3452 232.9456 147.7834 438.8831 63.6319 32.6264 23.1678 100.8327 29.5397 576.6053 724.5370 24.2405 22.8202 1992.2092 767.0772 1041.3043 830.8521 490.7497 491.1095
temp: 298.150 k
press: 1.00000 atm
elementType: 6 6 8 8 1 1 6 6 8 8 1 1 6 6 8 8 1 1 1 15 15 15 6 8 8 8 8 8 8 8 8 8 8 1 1 12 8 1 1 8 1 1 8 1 1 1 1 1 1
symmnumber: 1
zpe: 710400.5 jmol-1
zpe.correction: 0.270577 hartree
zpe.thermalcorrener: 0.302718 hartree
zpe.thermalcorrenthalpy: 0.303663 hartree
zpe.thermalcorrgfe: 0.205457 hartree
zpe.sumelectzpe: -2932.260672 hartree
zpe.sumelectthermal: -2932.228531 hartree
zpe.sumelectthermalent: -2932.227587 hartree
zpe.sumelectthermalfe: -2932.325792 hartree
dipole: -2456.8236 -1104.8914 -2293.4149
dipole: 3537.8693
quadrupole: -314433.7112 -63884.5573 -274106.4234
quadrupole: -141281.3002 -293256.9823 -131971.3224
quadrupole: -96958.8139 153590.3400 -56631.5262 -141281.3002 -293256.9823 -131971.3224
hfenergy: -2932.5312495 hartree
pointgroup: C01 [X(C7H19Mg1O19P3)]
dipole: 3.9414977 1.0643611 7.6077893 debye
polarizability: 255.674237|-12.398845|240.4636989|7.4371963|2.5229612|248.2237513 unknown
InChI: InChI=1/C2H4O2.2C2H3O2.CH3O7P2.Mg.O3P.3H2O/c3*1-2(3)4;1-7-10(5,6)8-9(2,3)4;;1-4(2)3;;;/h3H,1H3;2*1H3;1H3;;;3*1H2/q;;-1;-2;+4;-1;;;/rC3H10MgO14P3.C2H4O2.C2H3O2.H2O/c1-3(5)14-4(6,7,15-19(8)9)16-20(10,11)18-21(12,13-2)17-4;2*1-2(3)4;/h6-7H2,1-2H3;3H,1H3;1H3;1H2
charge -4 multiplicity 1
49 atoms
C  124.89942562 62.35955462 122.27618419
C  126.23350549 62.12298635 122.96496991
O  126.2044646 61.10580213 123.82952913
O  127.21134087 62.8313169 122.7773919
H  124.57544396 63.38656806 122.48418857
H  124.13913616 61.65919193 122.62722282
C  129.0308171 55.0664422 123.79515206
C  129.59722317 55.90671139 122.68364296
O  128.79246247 56.38161731 121.83004577
O  130.85631256 56.05025476 122.65506396
H  129.37569116 55.45740103 124.76077103
H  129.46063828 54.0598851 123.70991022
C  130.58080882 59.06927675 124.7295679
C  129.24714123 59.64840522 124.24183967
O  129.0265602 59.53124426 122.99167061
O  128.4798009 60.2262409 125.0554618
H  131.36252729 59.82088017 124.54976328
H  130.8422686 58.19390507 124.12875723
H  127.12051953 60.90293657 124.20774475
P  128.98450839 57.23689865 116.75508403
P  127.95870479 54.63270668 118.03107095
P  126.40652563 58.63107803 120.45659542
C  130.95179966 55.59599415 116.22199301
O  130.01230506 56.52095683 115.67494901
O  129.84506215 57.55445172 117.98821841
O  128.79495226 55.08575734 119.28803593
O  126.15820692 60.11377198 120.58202874
O  128.31912674 58.35792978 116.01145949
O  128.70395992 53.60018816 117.19734202
O  127.76460065 58.22793421 119.86867843
O  127.90468827 56.08369524 117.08221928
O  126.49898409 54.36918654 118.33392593
O  125.25247465 57.68378043 120.27655787
H  130.49378767 54.93749026 116.96127871
H  131.81058222 56.12270385 116.65737307
Mg 129.38434709 56.96784401 119.86780475
O  131.23898429 55.59142668 119.953462
H  131.25406412 55.48052736 120.92686103
H  130.48345718 55.03024084 119.62294399
O  126.87878345 58.20992201 122.31390404
H  127.56294949 58.89910266 122.59036854
H  127.43669548 57.38997637 122.22186003
O  130.6634315 58.3132257 121.03001274
H  130.06330857 58.81376774 121.638061
H  130.99058381 57.5913927 121.61678961
H  131.28410692 54.98290155 115.41040166
H  127.96569599 54.96924982 123.82491883
H  130.63118605 58.79783413 125.76390963
H  125.01371277 62.24130277 121.21886796
