program: Gaussian 16
title: Reac
version: ES64L-G16RevC.02
method: RB3LYP
basis: 6-31G(d)
operation: Freq
keyword: #P
keyword: Geom=AllCheck
keyword: Guess=TCheck
keyword: SCRF=Check
keyword: Test
keyword: GenChk
keyword: RB3LYP/6-31G(d)
keyword: Freq
converged: YES YES NO YES
title: Mulliken charges:
elementType: C C O O H H C C O O H H C C O O H H H P P P C O O O O O O O O O O H H Mg O H H O H H O H H H H H H
charge: -0.516923 0.593883 -0.622690 -0.531626 0.146934 0.165900 -0.528120 0.629534 -0.560280 -0.629804 0.154804 0.157879 -0.547842 0.584009 -0.593062 -0.616978 0.150617 0.172500 0.429328 1.223567 1.149639 1.127739 -0.228895 -0.569758 -0.714297 -0.767859 -0.751665 -0.679272 -0.751086 -0.685741 -0.692117 -0.725724 -0.687582 0.196423 0.125789 0.532742 -0.845923 0.430480 0.459606 -0.779594 0.457162 0.469229 -0.860648 0.474575 0.442325 0.110352 0.170059 0.137336 0.195076
chargesum: -4.00000
polarizability: 2.55519312e+02 -1.37667435e+01 2.30059632e+02 9.10217574e+00 6.71033481e-02 2.51280417e+02
frequency: 19.3121 25.6366 38.6935 51.0887 57.2116 65.6973 70.2150 76.6780 82.1503 89.7768 90.7120 95.6825 109.6004 110.8343 128.0462 129.6615 137.3323 158.7727 159.7319 168.5289 183.6333 187.7203 193.3391 203.1131 216.8830 229.1105 237.0952 246.3625 262.3928 267.0727 280.7765 313.0255 321.6416 342.1697 351.8086 377.5596 388.2605 391.9250 409.4457 436.2816 444.2343 480.7038 482.1661 485.0332 485.8393 492.9494 503.4742 510.5638 517.9689 528.0029 555.3415 561.6429 574.8307 616.9210 621.4177 626.7189 646.8149 684.2437 707.6168 720.7968 737.1529 752.4083 757.4720 769.5113 771.0281 812.8967 831.6903 832.2835 853.5395 860.3241 869.1012 890.3081 930.2222 949.2700 973.3993 1003.8063 1052.3006 1069.6934 1106.2081 1126.7200 1143.3532 1150.6208 1153.2813 1200.1588 1204.7592 1210.2143 1211.4316 1234.7578 1239.8509 1250.0282 1271.8240 1311.4020 1317.9853 1404.9186 1419.8173 1428.5010 1435.4645 1441.9189 1461.5139 1487.5126 1638.2803 1644.9556 1698.6982 1757.2862 1780.4883 2944.6994 2946.4563 2950.4111 2970.6546 2977.0335 2979.1579 3013.3812 3033.9793 3037.0812 3292.8350 3324.3321 3381.1591 3441.9936 3476.8124 3566.8812
redmass: 12.6074 16.1978 14.2493 12.4588 11.5441 13.8197 11.3681 13.8751 15.0615 11.0978 13.5266 12.7056 13.0415 11.9913 11.3611 12.1380 13.0992 12.4845 10.9898 12.1177 11.4807 8.6104 10.3572 7.8800 11.2169 12.0047 7.8607 9.4899 13.4089 8.4651 12.8016 16.2547 10.5205 16.9076 10.7207 10.0046 7.9591 12.5744 7.8815 12.2476 6.5353 4.8598 2.9117 11.3880 16.1166 3.6726 5.2604 7.5875 17.0887 12.2796 2.9568 1.6933 1.3244 1.0784 1.0750 1.3817 15.6140 7.2438 1.1125 1.1304 2.6008 1.1465 2.8082 3.6120 2.6570 11.2094 2.2201 5.9676 6.0400 1.2385 12.8954 6.7877 2.1776 1.5397 2.7502 1.1690 15.7911 15.1141 7.4541 1.0390 1.0317 1.0728 1.2233 1.1280 2.4629 1.0758 15.6339 1.0986 15.2803 1.0706 2.6189 1.0477 1.8073 7.4360 1.0925 1.0348 1.1533 1.3897 7.1588 1.0323 7.3631 6.7799 1.1361 1.0866 9.9872 1.0081 1.0081 1.0080 1.0174 1.0080 1.0653 1.0092 1.0079 1.0080 1.0637 1.0691 1.0641 1.0675 1.0682 1.0693
irintensity: 4.2598 24.8490 2.2796 1.1014 17.3173 7.1975 32.1432 22.5745 16.3442 27.5251 3.7666 17.6069 7.5264 15.0380 11.0970 3.3439 15.6554 2.8550 6.6530 1.1034 1.5435 6.2566 33.8159 22.8547 3.8062 22.7732 6.8903 28.7076 7.9939 5.8314 0.3453 3.2827 3.3978 2.8647 9.4607 12.0407 1.4196 5.6688 62.1331 33.0921 30.7451 28.6033 10.3948 103.9091 79.8481 23.9706 27.2043 25.1012 275.0707 103.4029 55.2045 20.3005 127.0142 182.0272 92.0534 4.8501 164.8458 75.5587 113.2444 331.7141 27.8516 0.8494 33.2824 40.3280 51.7589 85.1646 85.0825 102.7171 427.3399 115.8769 421.8109 493.6788 748.6603 40.1849 12.5659 271.8004 577.4735 171.0984 380.7358 3.5761 2.3012 4.5831 85.2388 3.3356 182.0431 12.7161 396.8985 155.3665 461.6795 20.4282 463.6450 25.0070 399.1270 310.6466 83.1861 15.3396 36.9153 12.7310 322.2753 9.4316 898.9748 744.7875 115.0007 130.0275 453.5401 64.1123 43.4800 26.2892 443.3022 27.5257 1418.6620 9.8488 22.1412 20.7129 632.7853 1055.7878 1182.7782 1046.6217 496.7075 551.7865
temp: 298.150 k
press: 1.00000 atm
elementType: 6 6 8 8 1 1 6 6 8 8 1 1 6 6 8 8 1 1 1 15 15 15 6 8 8 8 8 8 8 8 8 8 8 1 1 12 8 1 1 8 1 1 8 1 1 1 1 1 1
symmnumber: 1
zpe: 710207.9 jmol-1
zpe.correction: 0.270504 hartree
zpe.thermalcorrener: 0.302352 hartree
zpe.thermalcorrenthalpy: 0.303296 hartree
zpe.thermalcorrgfe: 0.206060 hartree
zpe.sumelectzpe: -2932.294777 hartree
zpe.sumelectthermal: -2932.262929 hartree
zpe.sumelectthermalent: -2932.261984 hartree
zpe.sumelectthermalfe: -2932.359221 hartree
dipole: 10.0642 4.0635 18.3975
dipole: 21.3605
quadrupole: -277.6858 -334.1813 -372.3576
quadrupole: 0.8317 0.7183 -83.0939
quadrupole: 50.3891 -6.1064 -44.2827 0.8317 0.7183 -83.0939
hfenergy: -2932.5652806 hartree
pointgroup: C01 [X(C7H19Mg1O19P3)]
dipole: 3.7535042 1.2735167 7.3980377 debye
polarizability: 255.519312|-13.7667435|230.0596315|9.1021757|0.0671033|251.2804168 unknown
InChI: InChI=1/C2H4O2.2C2H3O2.CH3O7P2.Mg.H2O4P.2H2O/c3*1-2(3)4;1-7-10(5,6)8-9(2,3)4;;1-5(2,3)4;;/h3H,1H3;2*1H3;1H3;;1-2H;2*1H2/q;;-1;-2;+4;-1;;/rC3H12MgO15P3.C2H4O2.C2H3O2/c1-3(5)15-4(6,7,16-20(8,9)10)17-21(11,12)19-22(13,14-2)18-4;2*1-2(3)4/h8-9H,6-7H2,1-2H3;3H,1H3;1H3
charge -4 multiplicity 1
49 atoms
C  -3.51951777 4.67177132 1.92259591
C  -2.15926271 4.53419237 2.59738847
O  -2.17073777 3.71317284 3.65017513
O  -1.17588897 5.15669507 2.22649583
H  -3.9124786 5.67833552 2.11224182
H  -4.22863292 3.9314464 2.29634872
C  0.61186528 -2.62136495 3.44149113
C  1.19959526 -1.86565588 2.28510147
O  0.41242665 -1.48203042 1.3777059
O  2.45689144 -1.6936991 2.28080169
H  0.9441288 -2.16063369 4.38046897
H  1.04172384 -3.63215568 3.44100707
C  2.16184791 1.38154244 4.37597215
C  0.8478488 2.01385799 3.87320063
O  0.59699633 1.83262189 2.64103776
O  0.1511288 2.70392624 4.66758791
H  2.96865011 2.10618902 4.19478942
H  2.39421644 0.49541745 3.77869407
H  -1.23378225 3.4674467 3.95052012
P  0.61315515 -0.36676446 -3.62459286
P  -0.49372323 -2.96201743 -2.40980531
P  -2.0279429 0.64844318 0.37754192
C  2.53283823 -2.09176692 -4.13160305
O  1.66279974 -1.10066812 -4.67575599
O  1.42180799 -0.05708454 -2.35444948
O  0.44167794 -2.5831082 -1.20227174
O  -1.81644297 1.9560904 1.33331774
O  0.00081292 0.76928926 -4.39138231
O  0.1274329 -4.02799134 -3.30049471
O  -0.72580038 0.431157 -0.40114561
O  -0.49987011 -1.49851579 -3.34400017
O  -1.94960559 -3.12685426 -2.02425759
O  -3.32478765 0.83715137 -0.35041725
H  2.01987476 -2.74232512 -3.42196892
H  3.4021687 -1.623691 -3.65129582
Mg 0.96540978 -0.71992855 -0.48575548
O  2.86757449 -2.05394685 -0.44850225
H  2.85687257 -2.19297338 0.52226548
H  2.13378842 -2.61487157 -0.81970805
O  -2.16719189 -0.59757889 1.43714472
H  -0.95297275 1.93015207 1.8219353
H  -1.2930801 -1.05332262 1.48143748
O  2.20459764 0.60772166 0.71514107
H  1.60809036 1.09372877 1.34251421
H  2.553336 -0.12006602 1.28126695
H  2.86516215 -2.7048598 -4.94318623
H  -0.45325866 -2.71846767 3.47137713
H  2.21223009 1.1100593 5.41031586
H  -3.405244 4.55355783 0.86527458
