program: Gaussian 16
title: Molecule Name
version: ES64L-G16RevC.02
method: RB3LYP
basis: 6-31G(d)
operation: Freq
keyword: #N
keyword: Geom=AllCheck
keyword: Guess=TCheck
keyword: SCRF=Check
keyword: Test
keyword: GenChk
keyword: RB3LYP/6-31G(d)
keyword: Freq
converged: YES YES NO NO
title: Mulliken charges:
elementType: C C O O H H C C O O H H C C O O H H P P P C O O O O O O O O O O H H Mg O H H O H H O H H H H H H
charge: -0.496552 0.467686 -0.681916 -0.682255 0.116141 0.105865 -0.526217 0.632915 -0.570364 -0.630987 0.158860 0.151737 -0.534433 0.579023 -0.644630 -0.605463 0.140351 0.160526 1.230241 1.142178 1.075014 -0.226219 -0.571681 -0.714806 -0.767555 -0.679055 -0.678805 -0.754926 -0.687140 -0.692269 -0.721738 -0.700985 0.200591 0.121156 0.517651 -0.851020 0.430877 0.459117 -0.821671 0.468825 0.466642 -0.856580 0.474021 0.442272 0.103594 0.170271 0.129011 0.152703
chargesum: -5.00000
dipole: -3052.0501 -1404.4444 -2882.2160
dipole: 4426.5837
quadrupole: -388210.6821 -82641.7213 -346299.2239
quadrupole: -178361.1656 -366222.5780 -168698.3350
quadrupole: -115826.8063 189742.1545 -73915.3481 -178361.1656 -366222.5780 -168698.3350
hfenergy: -2931.935827 hartree
pointgroup: C01 [X(C7H18Mg1O19P3)]
dipole: 10.4014933 -7.5921725 2.8495263 debye
polarizability: 253.8726239|-2.5891816|233.099787|7.3931155|3.9379421|249.1714423 unknown
InChI: InChI=1/3C2H3O2.CH3O7P2.Mg.O3P.3H2O/c3*1-2(3)4;1-7-10(5,6)8-9(2,3)4;;1-4(2)3;;;/h3*1H3;1H3;;;3*1H2/q;;-1;-2;+4;-1;;;/rC3H10MgO14P3.2C2H3O2.H2O/c1-3(5)14-4(6,7,15-19(8)9)16-20(10,11)18-21(12,13-2)17-4;2*1-2(3)4;/h6-7H2,1-2H3;2*1H3;1H2
charge -5 multiplicity 1
48 atoms
C  124.89945636 62.35954733 122.27618814
C  124.22733043 63.71509717 122.6316094
O  124.91030835 64.54792043 123.29446105
O  123.04211911 63.87432469 122.21612356
H  124.26894127 61.52403901 122.6045857
H  125.8848917 62.25559066 122.74184844
C  129.03081929 55.06647532 123.79518366
C  129.60805571 55.83825078 122.6437501
O  128.80531255 56.26813809 121.76805173
O  130.86750126 55.98817347 122.61647873
H  129.35448369 55.53378703 124.7337079
H  129.46812862 54.05941946 123.79063423
C  130.58076891 59.0692149 124.72956227
C  129.11729817 58.97566164 124.27634974
O  128.88732532 59.30010242 123.04990068
O  128.26637812 58.586996 125.09591152
H  130.97561108 60.08081373 124.5788014
H  131.19561949 58.38083841 124.13870431
P  128.96759045 57.21644031 116.74534188
P  128.03517582 54.57485878 118.00363633
P  126.34441748 58.40742309 120.46232776
C  130.95180248 55.59599709 116.22199365
O  130.01593516 56.52073811 115.66944666
O  129.81930031 57.56497745 117.97559345
O  128.90141481 55.04534293 119.23090577
O  125.95500547 59.85587703 120.59145617
O  128.27656566 58.31504483 115.99105618
O  128.77547956 53.56393653 117.13685063
O  127.73995974 58.15130089 119.86686861
O  127.91959902 56.03226063 117.06767047
O  126.59267536 54.26675481 118.34498916
O  125.29374622 57.35316464 120.23264002
H  130.49468218 54.93709258 116.95983016
H  131.8108051 56.12297587 116.65787955
Mg 129.38436353 56.96783212 119.8677909
O  131.31506298 55.67073808 119.91554949
H  131.29963135 55.54601778 120.88941434
H  130.58437032 55.0933767 119.5581043
O  126.80714672 57.9919092 122.28488374
H  127.52717193 58.65480663 122.61862609
H  127.34758942 57.16396454 122.19058383
O  130.60341434 58.32616079 121.072531
H  129.97005834 58.7798703 121.68969697
H  130.95604572 57.60070882 121.63804421
H  131.284104 54.98290048 115.41040192
H  127.96569784 54.96922268 123.82489539
H  130.63121656 58.79787824 125.76392012
H  125.01367203 62.24133283 121.21886496
