program: Gaussian 16
title: Molecule Name
version: ES64L-G16RevC.02
method: RB3LYP
basis: 6-31G(d)
operation: Freq
keyword: #P
keyword: Geom=AllCheck
keyword: Guess=TCheck
keyword: SCRF=Check
keyword: Test
keyword: GenChk
keyword: RB3LYP/6-31G(d)
keyword: Freq
converged: YES YES NO NO
title: Mulliken charges:
elementType: C C O O H H C C O O H H C C O O H H P P P C O O O O O O O O O O H H Mg O H H O H H O H H H H H H
charge: -0.518305 0.481080 -0.676300 -0.675806 0.118197 0.128980 -0.518521 0.595667 -0.530324 -0.646842 0.163772 0.130027 -0.537560 0.561357 -0.615001 -0.623035 0.136440 0.138187 1.214723 1.245022 1.094610 -0.237833 -0.563802 -0.691461 -0.731524 -0.711809 -0.660724 -0.679736 -0.720960 -0.687559 -0.667671 -0.727921 0.181076 0.146399 0.546897 -0.835728 0.436863 0.448416 -0.960510 0.410672 0.427379 -0.874920 0.482946 0.443497 0.119591 0.171550 0.128546 0.141961
chargesum: -5.00000
polarizability: 2.44188297e+02 -3.50233908e+00 2.25252955e+02 -8.40050596e+00 6.55773691e+00 2.62216668e+02
frequency: 16.1613 25.2591 33.5125 39.7538 43.3686 47.8454 54.7308 63.5813 77.7952 78.3564 79.5572 87.6197 93.9909 102.8146 115.6928 131.1738 136.4932 152.8107 157.0676 171.4246 180.5280 187.8500 200.3520 204.4666 209.0891 211.7285 224.5788 253.1557 259.3319 269.1376 286.0605 290.5551 300.6030 332.2367 336.5902 343.8437 367.0578 368.6993 383.5789 388.2156 416.4190 433.8918 463.1257 467.8537 488.1470 491.9596 499.4673 507.7275 520.8407 534.9416 552.1250 570.9369 586.9241 615.5356 627.1137 638.3682 649.9430 654.1593 658.9568 698.1594 707.8045 719.1723 720.9388 754.9005 758.8213 765.9643 824.5843 827.2062 832.2202 839.1247 845.7295 890.2507 933.0504 975.3059 981.4024 1013.4037 1053.6200 1082.0487 1106.7603 1109.7728 1110.3823 1134.6622 1138.2777 1162.2738 1197.7026 1203.1049 1226.2923 1258.2733 1264.6832 1296.2537 1386.1180 1388.5469 1416.9833 1422.7201 1426.8912 1431.1689 1494.9689 1632.8760 1685.7198 1687.8230 1699.0553 1749.8353 1751.7588 2947.7301 2951.6645 2955.7530 2957.6025 2978.7388 2983.4114 2994.1705 3002.8541 3022.8997 3306.6370 3382.0121 3543.3687 3597.2191 3670.4949
redmass: 16.1673 13.2216 11.2953 15.7439 15.7922 13.5546 13.1386 9.0119 12.1175 14.7685 12.8606 12.4445 10.1206 11.7741 13.9174 9.1219 10.0721 10.3545 14.0383 11.9310 10.7034 11.0207 9.1619 7.0861 9.2140 8.5662 11.5575 8.0688 15.6949 16.0711 13.3424 16.1311 8.2863 14.2028 14.2717 17.4691 11.0766 14.6537 7.6833 14.6039 7.0429 8.9844 14.6234 6.3732 1.4347 14.3078 15.4427 13.2597 13.5787 2.0000 2.5758 13.4567 1.4130 1.0564 1.1629 5.9907 1.0560 1.1675 8.9939 1.3611 2.4344 1.0721 1.3627 2.5418 4.3001 2.3690 13.7971 1.2863 2.7555 10.9224 12.2859 11.9984 14.7833 13.6021 1.2464 1.0894 16.4595 16.9360 1.0560 1.3121 4.3778 1.0763 1.0306 1.0907 1.1270 20.2921 17.0832 1.0642 11.8016 1.0796 11.5049 13.1135 1.1104 1.0304 1.0160 6.2532 1.0262 3.5897 5.7007 10.7999 1.3589 1.1413 1.0717 1.0080 1.0080 1.0084 1.0081 1.0111 1.0679 1.0081 1.0083 1.0080 1.0651 1.0627 1.0654 1.0691 1.0684
irintensity: 8.6258 18.8073 44.1296 1.1120 5.0500 15.5977 5.3270 17.1654 7.4459 32.1186 2.8979 49.5628 13.5152 22.9676 18.1716 8.2928 9.6362 15.0080 0.9678 5.2330 2.3589 26.9681 5.4729 32.7380 6.1912 6.6987 14.8398 5.7206 7.7998 4.7283 7.7013 11.4670 9.6492 2.4309 21.7649 8.6736 13.9203 18.2244 3.2043 7.0461 0.4230 66.1133 107.8113 6.7667 3.8278 386.8456 35.9059 90.9699 35.9768 88.5897 298.5521 27.5125 7.3785 102.0143 54.6382 297.4417 63.6509 3.8187 103.6675 374.3827 49.0573 148.5519 133.0077 11.4159 10.8683 103.9254 73.1043 155.5238 98.5071 62.3268 795.9345 156.9932 462.3059 61.8303 123.4330 196.3206 434.3570 310.3853 4.0665 120.5249 384.8973 15.9410 1.6370 11.2982 0.1373 419.9746 481.3041 8.7940 567.9872 64.8681 365.6856 323.9447 70.7244 27.8438 4.8406 282.5756 11.6788 425.0985 947.0700 626.8638 177.4187 57.0125 155.9747 43.1763 43.2122 69.5713 56.0570 68.5289 1670.7755 51.5062 74.1358 13.5346 813.7686 905.9163 332.0555 477.5214 223.3863
temp: 298.150 k
press: 1.00000 atm
elementType: 6 6 8 8 1 1 6 6 8 8 1 1 6 6 8 8 1 1 15 15 15 6 8 8 8 8 8 8 8 8 8 8 1 1 12 8 1 1 8 1 1 8 1 1 1 1 1 1
symmnumber: 1
zpe: 673415.5 jmol-1
zpe.correction: 0.256490 hartree
zpe.thermalcorrener: 0.289077 hartree
zpe.thermalcorrenthalpy: 0.290021 hartree
zpe.thermalcorrgfe: 0.189507 hartree
zpe.sumelectzpe: -2931.709596 hartree
zpe.sumelectthermal: -2931.677010 hartree
zpe.sumelectthermalent: -2931.676066 hartree
zpe.sumelectthermalfe: -2931.776580 hartree
dipole: -3049.8252 -1415.2214 -2890.8104
dipole: 4434.0805
quadrupole: -387654.0403 -83836.3859 -348396.4869
quadrupole: -179626.2831 -367048.2166 -170452.7938
quadrupole: -114358.4026 189459.2518 -75100.8492 -179626.2831 -367048.2166 -170452.7938
hfenergy: -2931.9660866 hartree
pointgroup: C01 [X(C7H18Mg1O19P3)]
dipole: 10.8542816 -10.5585565 -1.9330396 debye
polarizability: 244.1882966|-3.5023391|225.2529546|-8.400506|6.5577369|262.2166681 unknown
InChI: InChI=1/3C2H3O2.CH3O10P3.Mg.3H2O/c3*1-2(3)4;1-9-13(5,6)11-14(7,8)10-12(2,3)4;;;;/h3*1H3;1H3;;3*1H2/q;;-1;-3;+4;;;/rC3H10MgO14P3.2C2H3O2.H2O/c1-3(5)13-4(6,7)14-19(8,9)17-21(11,16-4)18-20(10,12-2)15-4;2*1-2(3)4;/h6-7H2,1-2H3;2*1H3;1H2
charge -5 multiplicity 1
48 atoms
C  124.90063949 62.35908156 122.27620428
C  124.16337927 63.69351938 122.59792744
O  124.73614458 64.74822309 122.20056179
O  123.06597841 63.61411707 123.21806585
H  124.36881829 61.48910525 122.67462576
H  125.91274731 62.37511819 122.70090358
C  129.03101103 55.06592842 123.79602461
C  129.65040255 55.46731369 122.47560453
O  128.90520674 55.67482536 121.48641964
O  130.92351098 55.58880048 122.46590748
H  129.3159898 55.81956416 124.5407069
H  129.4848733 54.12384162 124.1323585
C  130.58050832 59.06912679 124.72997241
C  129.09226538 59.26947131 124.36490173
O  128.73538093 58.9333715 123.18399785
O  128.35737967 59.75125141 125.25072853
H  131.12891864 60.01088728 124.59470096
H  131.06290111 58.30157826 124.1172416
P  129.59100315 57.81948967 116.69122537
P  127.61251887 55.70857997 117.58119613
P  126.17251564 57.60411224 119.46375822
C  130.95206261 55.59595692 116.22199438
O  130.540389 56.86346041 115.72046865
O  130.1746131 57.82749839 118.09957191
O  128.70006318 55.39599127 118.62151969
O  125.43025298 58.70257782 118.73308918
O  129.41618083 59.09908462 115.93456413
O  127.22838462 54.60938904 116.63034428
O  127.65541419 57.94364043 119.79057126
O  128.17483628 56.99307129 116.66640184
O  126.30798353 56.31914919 118.26526544
O  125.43349064 56.90005693 120.60189909
H  130.14065148 55.07592399 116.73610085
H  131.77557661 55.71059209 116.93849256
Mg 129.38400457 56.96813419 119.86697399
O  131.22534299 55.60535889 119.77654984
H  131.19991424 55.40702104 120.74986429
H  130.57493173 55.01250088 119.35334008
O  126.14794924 57.5212881 123.22592749
H  126.94117569 58.09293837 123.17233464
H  125.93163376 57.33137482 122.27815604
O  130.44148362 58.1285607 121.29515543
H  129.79069605 58.4839701 121.98587262
H  130.87762423 57.38468646 121.76571804
H  131.28405874 54.98278532 115.41039422
H  127.96569608 54.96954105 123.82449247
H  130.63129114 58.79802645 125.76393364
H  125.01262803 62.24161931 121.21871001
