program: Orca
programVersion: 6.0.1
elementType: Co Co Cu N N N N N O O O O O O O O O O O C C C C C C C C C H C C C H C H C H C H C H C H C H C H C C H C C C C H F F F F F F F F F F F F O H H C F F F H
charge: 0
multiplicity: 8
keywords: b3lyp D3BJ def2-TZVPP def2/J RIJCOSX TightSCF defgrid3 CPCM(Acetonitrile)
formula: C26H14Co2CuF15N5O12
InChI: InChI=1/C16H11N5.5C2F3O2.2Co.Cu.H2O.HO/c1-3-8-17-12(5-1)14-7-10-21-11-15(20-16(21)19-14)13-6-2-4-9-18-13;5*3-2(4,5)1(6)7;;;;;/h1-11H;;;;;;;;;1H2;1H/q-4;4*-2;-1;+4;+5;+4;;/rC26H12Co2CuF15N5O11.H2O/c30-22(31,32)16(50)53-28-47-9-4-2-6-13(47)14-7-10-45-11-15-12-5-1-3-8-46(12)27(48(15)21(45)49(14)28)51-17(23(33,34)35)56-29(60(27)28,57-18(52-27)24(36,37)38,58-19(54-28)25(39,40)41)59-20(55-28)26(42,43)44;/h1-11,60H;1H2
75 atoms
Co 8.193669 11.563247 13.682493
Co 8.355716 7.966828 13.51621
Cu 8.521427 9.832636 10.770656
N  8.499878 13.424785 14.604659
N  8.771697 6.149211 14.531643
N  9.108046 8.648241 15.329658
N  9.914249 9.545986 17.212729
N  9.100674 11.041947 15.519325
O  7.829584 9.776003 12.835862
O  7.114132 11.134599 10.220507
O  10.050996 8.569219 10.593283
O  7.370253 12.562341 11.97844
O  9.889806 11.27382 10.67383
O  7.633737 6.911157 11.834587
O  10.324246 7.946166 12.76654
O  6.22311 11.662258 14.476156
O  10.148621 11.72658 12.891524
O  7.281427 8.401266 10.146719
O  5.149942 10.049717 13.280877
C  10.645217 8.024159 11.560825
C  6.892887 12.179034 10.889886
C  9.12294 13.403911 15.806557
C  5.222292 11.011659 14.086215
C  7.164665 7.296837 10.743154
C  9.515432 7.651363 16.189126
C  10.437442 11.801724 11.677458
C  9.420519 12.064853 16.328127
C  8.184035 14.604114 14.053276
H  7.684691 14.555278 13.09285
C  9.351164 6.275061 15.750779
C  9.345462 9.79742 15.949208
C  8.574587 4.919277 14.032444
H  8.109833 4.876795 13.053882
C  9.446785 14.582716 16.483263
H  9.949001 14.552456 17.442082
C  9.7458 5.165395 16.500687
H  10.207592 5.300881 17.472135
C  8.47695 15.818441 14.668859
H  8.202489 16.747992 14.183508
C  10.020038 8.18428 17.358431
H  10.427091 7.735739 18.250321
C  9.119852 15.804957 15.904099
H  9.365095 16.73107 16.412637
C  8.942619 3.767206 14.720319
H  8.76377 2.794574 14.276504
C  10.001058 11.852671 17.604346
H  10.251697 12.682768 18.248943
C  12.004761 7.347192 11.212832
C  9.537473 3.894631 15.97569
H  9.83606 3.016207 16.53785
C  6.249503 6.284011 9.989424
C  3.851739 11.453492 14.688651
C  5.839574 13.151609 10.277124
C  10.242977 10.582726 18.040539
H  10.676733 10.330296 18.999271
F  6.358084 5.030484 10.476704
F  3.949558 12.497565 15.540516
F  2.987513 11.815836 13.703603
F  4.947182 6.658229 10.112024
F  6.357057 14.399452 10.148266
F  4.757819 13.244857 11.094263
F  3.274074 10.428204 15.371096
F  12.285542 7.362637 9.894013
F  13.020525 7.981186 11.855208
F  5.399038 12.76616 9.062167
F  12.014033 6.052876 11.618889
F  6.535088 6.235911 8.667115
O  6.280097 7.701973 14.245724
H  5.906716 6.924998 13.798819
H  5.74433 8.464049 13.921285
C  11.672567 12.699927 11.367099
F  11.983366 12.746774 10.055784
F  11.444026 13.973678 11.779771
F  12.76686 12.249227 12.031772
H  6.847802 9.7971 12.741674
elementType: Co Cu N O C H F
totalener: -8079.61514392019762 hartree
cpcmener: -0.08001051632663 hartree
kineticenergy: 8058.66405105976537 hartree
exchangeener: -481.729795910170 hartree
correlationener: -23.168717781813 hartree
xcener: -504.898513691983 hartree
s2: 15.767456
energy: -8792.2344 -7552.3625 -7552.2641 -1058.4997 -928.1539 -927.9938 -927.9929 -892.8913 -892.7884 -774.6360 -774.5358 -774.5123 -774.4308 -774.4118 -774.3225 -672.8033 -672.7998 -672.7965 -672.7887 -672.7883 -672.7878 -672.7873 -672.7843 -672.7837 -672.7745 -672.7667 -672.7613 -672.6882 -672.6769 -672.6739 -521.0406 -521.0369 -520.9832 -520.9708 -520.9449 -520.8223 -520.7486 -520.7233 -520.6798 -520.5322 -520.3566 -519.7702 -392.7706 -391.0876 -390.7001 -390.5974 -390.3954 -283.9470 -283.9455 -283.9379 -283.9088 -283.7678 -281.0168 -280.9998 -280.9944 -280.9543 -280.6912 -280.4209 -279.4142 -279.3042 -278.8849 -278.8085 -278.6588 -278.5180 -278.3717 -278.3047 -277.9439 -277.8186 -277.7485 -277.7423 -277.6014 -277.5848 -277.4596 -119.0325 -99.8198 -99.7277 -77.9937 -77.9907 -77.8459 -63.8893 -63.7936 -63.7772 -63.7504 -63.6803 -63.6718 -35.9323 -35.9306 -35.9251 -35.9024 -35.7921 -33.6381 -33.6356 -33.6311 -33.6093 -33.5931 -33.5930 -33.5878 -33.5652 -33.5032 -33.4650 -29.9491 -29.8661 -29.8002 -29.7423 -29.4884 -29.4686 -27.9004 -27.7077 -27.6279 -27.6038 -27.5548 -27.1979 -27.0306 -26.6510 -26.2252 -25.9379 -25.8166 -22.7040 -22.5144 -22.4139 -22.1055 -21.8255 -20.7506 -20.3289 -20.2887 -20.2755 -20.2441 -20.1048 -19.3203 -18.8720 -18.3459 -17.8519 -17.7496 -17.5666 -17.4734 -17.4558 -17.4170 -17.3445 -17.2678 -16.7753 -16.4496 -16.4452 -16.4393 -16.4324 -16.4198 -16.4169 -16.4122 -16.3921 -16.3136 -16.2815 -15.8284 -15.2981 -15.0846 -14.9677 -14.9396 -14.7930 -14.6422 -14.5691 -14.3731 -14.2503 -14.1466 -14.0924 -13.9200 -13.7424 -13.7290 -13.6714 -13.5040 -13.4634 -13.3107 -13.2819 -13.2121 -13.1897 -13.1774 -13.1255 -13.0910 -13.0828 -13.0813 -13.0745 -13.0492 -13.0093 -12.9845 -12.9075 -12.8707 -12.7744 -12.7057 -12.6284 -12.4908 -12.4672 -12.3363 -12.3113 -12.2961 -12.2238 -12.1901 -12.1658 -12.1326 -12.1253 -12.1069 -12.0806 -12.0720 -12.0137 -11.9726 -11.9085 -11.8969 -11.8552 -11.8269 -11.7262 -11.6990 -11.6691 -11.6375 -11.5784 -11.5762 -11.5734 -11.5558 -11.5386 -11.4685 -11.3331 -10.8166 -10.7005 -10.6347 -10.5632 -10.4762 -10.4486 -10.3339 -10.1154 -9.9938 -9.7605 -9.7109 -9.5368 -9.3731 -9.3598 -9.1621 -9.0556 -8.9950 -8.9357 -8.8420 -8.8222 -8.7954 -8.7179 -8.6941 -8.6298 -8.5978 -8.5427 -8.5001 -8.4678 -8.4049 -8.3575 -8.3429 -8.1066 -7.8382 -7.6504 -7.5543 -6.7897 -6.7224 -6.6827 -6.6099 -6.4409 -3.3756 -3.0178 -2.0497 -2.0262 -1.6983 -1.4465 -1.2924 -1.0368 -0.9765 -0.8346 -0.7288 electronvolt
chargesum: -0.0000000
charge: 1.155429 1.107848 0.702810 -0.159193 -0.216994 -0.253438 0.004246 -0.227793 -0.951645 -0.417189 -0.416870 -0.524250 -0.420882 -0.492527 -0.484097 -0.471241 -0.482667 -0.420388 -0.534060 0.335442 0.355211 0.116832 0.304890 0.349427 0.152019 0.344544 0.186541 -0.022542 0.171194 0.068909 0.251619 -0.022548 0.167694 -0.136984 0.159960 -0.142942 0.160875 -0.139527 0.175917 -0.073413 0.215031 -0.100758 0.182693 -0.145437 0.172255 -0.131303 0.169149 0.500493 -0.107049 0.179335 0.498339 0.500869 0.506945 0.004010 0.198562 -0.176174 -0.183126 -0.188462 -0.185440 -0.184053 -0.186040 -0.189392 -0.176377 -0.183688 -0.176780 -0.182594 -0.179229 -0.435564 0.247074 0.256083 0.502865 -0.176396 -0.183624 -0.182661 0.260228
charge: -0.087100 -0.089963 -0.037944 0.277227 0.269603 0.250595 0.360858 0.278991 0.161292 0.158132 0.165701 0.165857 0.166679 0.166312 0.159153 0.131956 0.155918 0.158896 0.058001 -0.485221 -0.488716 -0.110058 -0.537605 -0.482572 -0.136002 -0.485243 -0.086853 -0.028382 0.026270 -0.115716 -0.230937 -0.036719 0.026918 0.040723 0.037295 0.033573 0.039359 0.017780 0.037084 0.001574 0.029801 0.041014 0.040454 0.006443 0.034548 0.021221 0.042893 -0.593138 0.035892 0.038882 -0.593243 -0.595701 -0.592181 0.041185 0.049503 0.187614 0.179955 0.168513 0.171726 0.175761 0.174369 0.166952 0.188326 0.173903 0.187680 0.176584 0.180625 0.382763 -0.077597 -0.127216 -0.592917 0.188193 0.174791 0.175541 -0.169854
qa: 1.1554 1.1078 0.7028 -0.1592 -0.2170 -0.2534 0.0042 -0.2278 -0.9516 -0.4172 -0.4169 -0.5242 -0.4209 -0.4925 -0.4841 -0.4712 -0.4827 -0.4204 -0.5341 0.3354 0.3552 0.1168 0.3049 0.3494 0.1520 0.3445 0.1865 -0.0225 0.1712 0.0689 0.2516 -0.0225 0.1677 -0.1370 0.1600 -0.1429 0.1609 -0.1395 0.1759 -0.0734 0.2150 -0.1008 0.1827 -0.1454 0.1723 -0.1313 0.1691 0.5005 -0.1070 0.1793 0.4983 0.5009 0.5069 0.0040 0.1986 -0.1762 -0.1831 -0.1885 -0.1854 -0.1841 -0.1860 -0.1894 -0.1764 -0.1837 -0.1768 -0.1826 -0.1792 -0.4356 0.2471 0.2561 0.5029 -0.1764 -0.1836 -0.1827 0.2602
va: 3.9458 3.9977 2.5027 3.0510 3.0627 2.9012 3.5362 2.9846 1.4438 2.0326 2.0323 1.8989 2.0348 1.9158 1.9537 1.9133 1.9590 2.0361 1.9333 4.1341 4.1186 3.8594 4.1863 4.1375 3.8972 4.1175 3.9068 3.9665 1.0049 3.9089 4.0309 3.9698 1.0029 3.9417 1.0023 3.9342 0.9972 3.9013 0.9839 3.9066 0.9766 3.8970 0.9818 3.9008 0.9859 3.8933 1.0003 4.4875 3.8970 0.9839 4.4692 4.4667 4.4449 3.8936 0.9808 1.1259 1.1181 1.1040 1.1094 1.1120 1.1097 1.1050 1.1299 1.1118 1.1305 1.1153 1.1227 2.0506 1.0022 1.0349 4.4823 1.1300 1.1119 1.1142 1.0423
dispersion: -0.210049875 hartree
energy: -8079.825193794808 hartree
dipole: 10.967029126 -7.190021860 3.777007266 -5.861621793 4.813438488 -1.048183305 61.065683247 -49.844193740 11.221489507
dipolemethod: SCF
magnitude: 11.886391331 au
magnitude: 30.212805713 debye
