program: Orca
programVersion: 6.0.0
elementType: Cu Ni Ni N N N N N C H C H C H C H C C C H C H C C H C C C H C H C H C H O H O O C C F F F O O C C F F F O O C C F F F O O C C F F F O O C C F F F O H H
charge: 0
multiplicity: 6
keywords: TPSS D3BJ Freq def2-TZVPP def2/J RIJCOSX TightSCF defgrid3 CPCM(Acetonitrile)
frequency: 0.00 0.00 0.00 0.00 0.00 0.00 12.31 13.88 15.16 15.37 16.15 16.85 18.30 19.92 21.42 21.90 32.57 36.29 40.24 44.05 46.44 52.30 58.40 61.48 64.19 70.93 76.31 81.77 85.01 91.70 95.52 98.73 104.81 107.91 113.75 117.23 126.50 130.44 134.11 135.29 140.61 144.09 149.32 152.07 158.40 162.39 170.16 176.71 183.86 191.41 194.83 202.23 211.55 212.52 215.56 218.77 223.17 230.90 254.15 254.83 262.24 269.98 274.45 277.14 280.02 285.08 293.16 300.22 304.79 310.19 312.41 312.66 320.84 346.04 362.15 369.69 374.40 407.10 412.05 418.56 421.70 431.76 434.60 438.94 443.07 443.85 448.34 450.11 455.21 457.54 462.35 467.99 475.95 491.84 493.06 493.90 494.62 495.43 495.89 507.02 516.07 579.04 580.21 585.17 590.40 593.53 594.92 616.18 618.51 636.19 647.52 649.01 657.93 679.31 693.11 694.11 694.73 697.11 698.80 713.35 738.29 739.64 751.09 759.33 760.74 761.46 762.02 762.78 763.72 766.06 785.98 797.24 801.43 805.68 816.40 820.94 823.69 824.01 858.87 894.92 903.19 927.64 956.06 957.25 967.05 981.48 983.94 1014.23 1015.43 1018.39 1025.45 1044.19 1045.45 1047.75 1050.28 1053.60 1055.59 1057.53 1059.12 1090.72 1091.08 1097.29 1099.30 1100.37 1102.85 1104.18 1123.98 1132.16 1145.84 1146.92 1148.99 1151.20 1153.53 1160.39 1164.34 1166.23 1170.70 1228.67 1254.16 1285.29 1293.50 1297.98 1303.09 1327.95 1353.92 1360.23 1379.90 1380.92 1384.12 1386.15 1387.47 1390.87 1422.07 1457.32 1462.82 1472.30 1481.78 1527.19 1547.66 1559.37 1578.39 1581.75 1606.66 1611.38 1612.68 1618.76 1622.11 1627.10 1629.30 1633.45 1660.90 3050.96 3145.69 3158.79 3166.89 3167.38 3173.30 3180.94 3181.08 3187.27 3195.44 3204.02 3216.92 3252.99 3720.60
frequency: 12.31 13.88 15.16 15.37 16.15 16.85 18.30 19.92 21.42 21.90 32.57 36.29 40.24 44.05 46.44 52.30 58.40 61.48 64.19 70.93 76.31 81.77 85.01 91.70 95.52 98.73 104.81 107.91 113.75 117.23 126.50 130.44 134.11 135.29 140.61 144.09 149.32 152.07 158.40 162.39 170.16 176.71 183.86 191.41 194.83 202.23 211.55 212.52 215.56 218.77 223.17 230.90 254.15 254.83 262.24 269.98 274.45 277.14 280.02 285.08 293.16 300.22 304.79 310.19 312.41 312.66 320.84 346.04 362.15 369.69 374.40 407.10 412.05 418.56 421.70 431.76 434.60 438.94 443.07 443.85 448.34 450.11 455.21 457.54 462.35 467.99 475.95 491.84 493.06 493.90 494.62 495.43 495.89 507.02 516.07 579.04 580.21 585.17 590.40 593.53 594.92 616.18 618.51 636.19 647.52 649.01 657.93 679.31 693.11 694.11 694.73 697.11 698.80 713.35 738.29 739.64 751.09 759.33 760.74 761.46 762.02 762.78 763.72 766.06 785.98 797.24 801.43 805.68 816.40 820.94 823.69 824.01 858.87 894.92 903.19 927.64 956.06 957.25 967.05 981.48 983.94 1014.23 1015.43 1018.39 1025.45 1044.19 1045.45 1047.75 1050.28 1053.60 1055.59 1057.53 1059.12 1090.72 1091.08 1097.29 1099.30 1100.37 1102.85 1104.18 1123.98 1132.16 1145.84 1146.92 1148.99 1151.20 1153.53 1160.39 1164.34 1166.23 1170.70 1228.67 1254.16 1285.29 1293.50 1297.98 1303.09 1327.95 1353.92 1360.23 1379.90 1380.92 1384.12 1386.15 1387.47 1390.87 1422.07 1457.32 1462.82 1472.30 1481.78 1527.19 1547.66 1559.37 1578.39 1581.75 1606.66 1611.38 1612.68 1618.76 1622.11 1627.10 1629.30 1633.45 1660.90 3050.96 3145.69 3158.79 3166.89 3167.38 3173.30 3180.94 3181.08 3187.27 3195.44 3204.02 3216.92 3252.99 3720.60
formula: C26H14CuF15N5Ni2O12
InChI: InChI=1/C16H11N5.5C2F3O2.Cu.2Ni.H2O.HO/c1-3-8-17-12(5-1)14-7-10-21-11-15(20-16(21)19-14)13-6-2-4-9-18-13;5*3-2(4,5)1(6)7;;;;;/h1-11H;;;;;;;;;1H2;1H/q-4;3*-2;2*-1;+3;+4;+5;;/rC26H14CuF15N5Ni2O12/c28-22(29,30)16(50)54-48-45-9-4-2-6-13(45)15-11-43-10-7-14-12-5-1-3-8-44(12)27(46(14)21(43)47(15)48)53-18(24(34,35)36)58-49(52,61(27)48,55-17(51)23(31,32)33,59-19(56-48)25(37,38)39)60-20(57-48)26(40,41)42/h1-11,61H,52H2
75 atoms
Cu 11.100027 4.923631 17.976172
Ni 9.499355 8.11263 18.306542
Ni 8.367386 5.092019 19.407649
N  12.144409 3.490832 17.055865
N  11.658847 5.928714 16.299909
N  10.691499 8.087429 16.686581
N  11.870061 7.800837 14.814155
N  9.233214 10.065878 17.622381
C  12.31602 2.252764 17.532059
H  11.88345 2.050038 18.503543
C  13.012058 1.280427 16.818075
H  13.128036 0.288635 17.238689
C  13.539951 1.611008 15.573889
H  14.084484 0.876524 14.990736
C  13.361136 2.900507 15.078962
H  13.762151 3.17606 14.1115
C  12.656099 3.825974 15.846903
C  12.401499 5.210598 15.44121
C  12.898249 5.773705 14.242099
H  13.497267 5.189182 13.558585
C  12.625399 7.077214 13.936915
H  12.965203 7.584505 13.0434
C  11.395002 7.206518 15.999854
C  11.416868 9.099157 14.792096
H  11.641218 9.765921 13.975266
C  10.685983 9.252197 15.953908
C  9.916252 10.365688 16.489879
C  9.863118 11.633008 15.908381
H  10.42313 11.841451 15.003605
C  9.083821 12.613411 16.514871
H  9.025117 13.607337 16.084319
C  8.384276 12.301529 17.679895
H  7.76724 13.038167 18.181573
C  8.487113 11.014124 18.201681
H  7.964953 10.717086 19.104328
O  9.961816 6.218576 18.887701
H  10.437425 6.449847 19.740357
O  11.530872 4.070088 19.742353
O  9.514224 4.106034 20.807401
C  10.732196 3.864023 20.6993
C  11.421476 3.191612 21.925349
F  11.952402 1.991053 21.577019
F  10.569874 2.978933 22.947846
F  12.436042 3.964094 22.389068
O  6.966623 5.837114 18.11358
O  7.961883 7.574598 17.024814
C  7.090156 6.696617 17.20751
C  5.984407 6.612587 16.111088
F  6.244013 5.567613 15.274823
F  5.911005 7.726148 15.349537
F  4.756663 6.4032 16.644028
O  8.214221 8.395011 19.888574
O  7.777832 6.37831 20.874781
C  7.786935 7.629445 20.786056
C  7.180789 8.394553 22.002788
F  6.228018 9.275766 21.60232
F  6.616549 7.578518 22.918065
F  8.147554 9.110496 22.638668
O  11.009846 8.896614 19.5292
O  11.209081 7.185157 21.013742
C  11.41622 8.339778 20.587028
C  12.289155 9.282856 21.472591
F  13.300059 9.845429 20.759387
F  12.847881 8.64882 22.527315
F  11.535356 10.30294 21.969838
O  9.008841 3.883647 17.840097
O  7.226496 2.503072 17.624293
C  8.270569 3.047207 17.230485
C  8.769498 2.652603 15.805633
F  9.42302 3.664536 15.185304
F  9.62989 1.599373 15.878456
F  7.748971 2.281145 15.001701
O  6.812889 3.774412 19.942291
H  5.987468 4.282909 19.884202
H  6.818713 3.198302 19.125058
elementType: Cu Ni N C H O F
totalener: -8333.11385989137671 hartree
cpcmener: -0.09661665544451 hartree
kineticenergy: 8311.69032524181421 hartree
exchangeener: -616.560584091190 hartree
correlationener: -19.136699331922 hartree
xcener: -635.697283423112 hartree
s2: 8.758535
energy: -8766.8897 -8135.8069 -8135.7796 -1047.2448 -963.4848 -963.4620 -917.2219 -917.1516 -916.9387 -839.3005 -839.2872 -839.2827 -839.2707 -839.2611 -839.2319 -665.3146 -665.3009 -665.2947 -665.2873 -665.2770 -665.2617 -665.2263 -665.2161 -665.2123 -665.2122 -665.1993 -665.1923 -665.1437 -665.1312 -665.1278 -514.5278 -514.3955 -514.3645 -514.3233 -514.2005 -514.1356 -514.1212 -514.1137 -514.1032 -513.8767 -513.8752 -513.6544 -387.0334 -385.7591 -385.4474 -384.8929 -384.8536 -278.6209 -278.5383 -278.4778 -278.4653 -278.3484 -275.6843 -275.4886 -275.4603 -275.4312 -275.4185 -275.1787 -274.4356 -274.3164 -274.0228 -273.7279 -273.7075 -273.6131 -273.5837 -273.2297 -273.0645 -272.9254 -272.8982 -272.7273 -272.6761 -272.6072 -272.4607 -115.6804 -107.1680 -107.1481 -75.6267 -75.3123 -74.4139 -69.2969 -69.2816 -69.2740 -69.2379 -69.1904 -69.1820 -33.6802 -33.6359 -33.5725 -33.5577 -33.4739 -31.4654 -31.4169 -31.4168 -31.3874 -31.3655 -31.3489 -31.3163 -31.3014 -31.2695 -31.2273 -28.0403 -27.8622 -27.7944 -27.7286 -27.6771 -27.4300 -26.0983 -25.9361 -25.6918 -25.6488 -25.6193 -25.5134 -25.2921 -25.0638 -24.9174 -24.8167 -24.3193 -21.3224 -21.1569 -20.8949 -20.7046 -20.4150 -19.4168 -18.6717 -18.5664 -18.5285 -18.4905 -18.3696 -18.0507 -17.6804 -17.0950 -16.7053 -16.5025 -16.1899 -15.9371 -15.8287 -15.7907 -15.7317 -15.6028 -15.5726 -14.8419 -14.8253 -14.8083 -14.7741 -14.7431 -14.7386 -14.7249 -14.7092 -14.6985 -14.6449 -14.6106 -14.2516 -13.9135 -13.5280 -13.4325 -13.3922 -13.3581 -13.1680 -13.1133 -13.0659 -12.9551 -12.7823 -12.6557 -12.6111 -12.4496 -12.4215 -12.2815 -12.2282 -12.1044 -11.9991 -11.9476 -11.8832 -11.7724 -11.6309 -11.6184 -11.5723 -11.4985 -11.4406 -11.4219 -11.3592 -11.3370 -11.3313 -11.3163 -11.2833 -11.2563 -11.2484 -11.1872 -11.1215 -11.0849 -11.0688 -10.9629 -10.9291 -10.8541 -10.8358 -10.7748 -10.7152 -10.6732 -10.6525 -10.5286 -10.4639 -10.4253 -10.3853 -10.3729 -10.3450 -10.3383 -10.2888 -10.2636 -10.2394 -10.1875 -10.1467 -10.1144 -10.0921 -10.0170 -9.9649 -9.8967 -9.8766 -9.8701 -9.8220 -9.8039 -9.7457 -9.7089 -9.6455 -9.5547 -9.4540 -8.8982 -8.6960 -8.6380 -8.5517 -8.4649 -8.3761 -8.3276 -8.2141 -8.1884 -8.0308 -7.9630 -7.8612 -7.8077 -7.7189 -7.6572 -7.5905 -7.5247 -7.4730 -7.4232 -7.3765 -7.3262 -7.2555 -7.2262 -7.0903 -7.0078 -6.8302 -6.7360 -6.6548 -6.5145 -6.4747 -6.4454 -6.4173 -6.2620 -6.1309 -6.0192 -5.6694 -5.4470 -5.4150 -5.1286 -3.8051 -2.5709 -2.3421 -2.1403 -1.8217 -1.5583 -1.4339 -1.3290 -1.2425 -1.1127 -1.0274 electronvolt
energy: -8766.8842 -8135.7932 -8135.7657 -1046.8628 -962.5531 -962.5291 -916.8160 -916.7870 -916.7773 -838.5378 -838.5255 -838.5176 -838.5103 -838.5058 -838.4839 -665.3123 -665.2997 -665.2934 -665.2873 -665.2772 -665.2599 -665.2250 -665.2147 -665.2112 -665.2108 -665.1982 -665.1912 -665.1417 -665.1314 -665.1275 -514.4586 -514.3429 -514.3163 -514.2745 -514.1441 -514.0803 -514.0750 -514.0629 -513.8909 -513.8760 -513.8174 -513.6531 -387.0258 -385.7016 -385.3825 -384.8352 -384.7976 -278.6083 -278.5338 -278.4660 -278.4537 -278.3425 -275.6885 -275.4891 -275.4624 -275.4309 -275.4207 -275.1799 -274.4377 -274.3180 -274.0220 -273.7288 -273.7080 -273.6124 -273.5849 -273.2320 -273.0628 -272.9270 -272.8966 -272.7230 -272.6786 -272.6049 -272.4570 -114.8272 -104.9730 -104.9658 -74.3826 -74.3343 -74.1274 -67.1034 -67.0993 -67.0938 -67.0771 -67.0422 -67.0304 -33.6758 -33.6345 -33.5688 -33.5540 -33.4719 -31.4615 -31.4155 -31.4145 -31.3869 -31.3626 -31.3461 -31.3140 -31.2992 -31.2672 -31.2269 -27.9587 -27.8336 -27.7379 -27.6815 -27.6124 -27.3891 -26.0196 -25.8312 -25.6142 -25.5843 -25.5338 -25.4645 -25.2191 -25.0071 -24.7696 -24.5692 -24.2742 -21.3060 -21.1427 -20.8791 -20.6875 -20.4044 -19.4073 -18.6328 -18.5511 -18.4960 -18.4572 -18.3513 -18.0302 -17.6624 -17.0740 -16.6829 -16.4848 -16.1707 -15.9012 -15.8040 -15.7647 -15.6953 -15.5804 -15.5475 -14.8365 -14.8130 -14.8063 -14.7683 -14.7334 -14.7236 -14.7189 -14.6951 -14.6842 -14.6424 -14.6048 -14.2108 -13.8891 -13.4923 -13.3773 -13.3566 -13.2934 -13.1249 -13.0724 -13.0028 -12.9156 -12.6769 -12.5987 -12.5656 -12.4267 -12.2857 -12.1726 -12.0892 -12.0140 -11.9530 -11.8717 -11.8549 -11.7167 -11.6099 -11.6032 -11.5459 -11.4874 -11.4322 -11.4120 -11.3432 -11.3309 -11.3140 -11.2711 -11.2574 -11.2287 -11.1772 -11.1270 -11.0780 -11.0456 -10.9454 -10.9299 -10.8803 -10.8059 -10.7727 -10.7464 -10.6600 -10.6229 -10.4835 -10.4718 -10.4535 -10.4099 -10.3671 -10.3425 -10.3147 -10.2946 -10.2511 -10.2077 -10.1780 -10.1057 -10.0842 -10.0525 -9.9838 -9.8957 -9.8866 -9.8656 -9.8208 -9.8027 -9.7453 -9.7381 -9.6773 -9.5251 -9.3998 -9.3459 -9.0189 -8.5798 -8.3086 -8.2832 -8.2263 -8.2190 -8.1685 -8.0388 -7.9850 -7.8765 -7.7827 -7.7394 -7.7053 -7.5840 -7.4864 -7.4174 -7.3533 -7.3289 -7.3056 -7.2859 -7.2250 -7.1434 -7.0821 -7.0255 -6.9807 -6.7382 -6.7092 -6.3563 -6.2102 -5.7973 -5.7856 -5.7341 -5.6743 -5.6081 -5.5387 -4.4827 -3.7742 -2.9608 -2.8150 -2.7988 -2.5684 -2.5474 -2.3294 -2.1145 -1.8135 -1.5300 electronvolt
chargesum: -0.0000000
charge: 0.495692 0.808847 0.933590 -0.076208 -0.126543 -0.110774 0.104780 -0.151630 0.059195 0.112109 -0.074970 0.124454 -0.031395 0.130575 -0.104861 0.097685 0.195945 0.250885 -0.095927 0.108177 0.022864 0.142772 0.131598 -0.083838 0.146553 0.187823 0.088631 -0.113800 0.100065 -0.041926 0.123574 -0.074456 0.119309 0.016073 0.113428 -0.814152 0.346947 -0.442812 -0.395372 0.379556 0.402164 -0.153472 -0.146120 -0.153610 -0.443569 -0.425966 0.315450 0.395431 -0.160111 -0.152909 -0.154656 -0.478443 -0.418865 0.331231 0.408410 -0.159717 -0.151675 -0.163170 -0.453744 -0.467833 0.292277 0.401623 -0.161311 -0.155263 -0.164138 -0.488453 -0.425718 0.271409 0.464593 -0.163990 -0.166311 -0.153263 -0.428100 0.258383 0.246979
charge: -0.037793 -0.210191 -0.187715 0.288180 0.288348 0.277713 0.368032 0.292624 -0.010391 0.033612 0.030959 0.036835 0.052536 0.039120 0.054314 0.037439 -0.106758 -0.091579 0.032796 0.042752 0.046337 0.046955 -0.229026 0.016049 0.028305 -0.128703 -0.118281 0.040199 0.036463 0.037366 0.034706 0.015204 0.031611 -0.033684 0.023938 0.233658 -0.171540 0.176798 0.197562 -0.502265 -0.623812 0.185916 0.200900 0.187210 0.174223 0.182182 -0.517397 -0.620340 0.176742 0.191106 0.186422 0.183781 0.177237 -0.515232 -0.620527 0.181541 0.193626 0.179169 0.143332 0.087859 -0.559847 -0.623195 0.176941 0.188449 0.173317 0.203074 0.094715 -0.531091 -0.617819 0.202348 0.186070 0.193881 0.391033 -0.078324 -0.145973
qa: 0.4957 0.8088 0.9336 -0.0762 -0.1265 -0.1108 0.1048 -0.1516 0.0592 0.1121 -0.0750 0.1245 -0.0314 0.1306 -0.1049 0.0977 0.1959 0.2509 -0.0959 0.1082 0.0229 0.1428 0.1316 -0.0838 0.1466 0.1878 0.0886 -0.1138 0.1001 -0.0419 0.1236 -0.0745 0.1193 0.0161 0.1134 -0.8142 0.3469 -0.4428 -0.3954 0.3796 0.4022 -0.1535 -0.1461 -0.1536 -0.4436 -0.4260 0.3154 0.3954 -0.1601 -0.1529 -0.1547 -0.4784 -0.4189 0.3312 0.4084 -0.1597 -0.1517 -0.1632 -0.4537 -0.4678 0.2923 0.4016 -0.1613 -0.1553 -0.1641 -0.4885 -0.4257 0.2714 0.4646 -0.1640 -0.1663 -0.1533 -0.4281 0.2584 0.2470
va: 2.4102 3.3920 3.2356 3.2982 3.2695 2.9837 3.5447 3.0751 3.9890 1.0224 3.9315 0.9986 3.9203 0.9949 3.9648 1.0163 3.7019 3.8203 3.8804 1.0150 3.9165 0.9997 4.1825 3.9351 1.0024 3.8201 3.8731 3.9506 1.0125 3.9072 0.9984 3.9137 1.0004 4.0098 1.0246 1.6362 0.9506 2.0578 2.0585 4.0782 4.5621 1.1543 1.1722 1.1551 2.0278 2.0085 4.1922 4.5524 1.1404 1.1603 1.1556 1.9681 2.0321 4.1666 4.5234 1.1456 1.1650 1.1427 1.9701 2.0363 4.1996 4.5493 1.1408 1.1578 1.1342 1.8579 2.0971 4.3018 4.4319 1.1431 1.1392 1.1661 2.0674 0.9888 1.0645
dispersion: -0.161556531 hartree
energy: -8333.275416421891 hartree
dipole: 17.378759927 -10.582556261 6.796203666 11.888534721 -10.337437202 1.551097519 -38.832646351 27.549440961 -11.283205391
dipolemethod: SCF
magnitude: 13.262918671 au
magnitude: 33.711660153 debye
temp: 298.15 k
press: 1.00 atm
zeropoint: 0.42053555 hartree
thermalvibcorrection: 0.05772393 hartree
thermalrotcorrection: 0.00141627 hartree
thermaltrasncorrection: 0.00141627 hartree
thermaltotal: -8332.79432440 hartree
thermalcorr: 0.06055647 hartree
nonthermalcorr: 0.42053555 hartree
totalcorr: 0.48109202 hartree
thermalcorrenthalpy: 0.00094421 hartree
totalenthalpy: -8332.79338019 hartree
vibrat: 0.10805615 hartree
rotat: 0.01893170 hartree
transl: 0.02220727 hartree
total: 0.15088687 hartree
totalentropycorr: -0.15088687 hartree
gibbsenthalpy: -8332.94426706 hartree
gibbsminuselec: 0.33114936 hartree
