program: Orca
programVersion: 6.0.0
elementType: Cu Ni Ni N N N N N C H C H C H C H C C C H C H C C H C C C H C H C H C H O H O O C C F F F O O C C F F F O O C C F F F O O C C F F F O O C C F F F O H H
charge: 0
multiplicity: 6
keywords: TPSS D3BJ Freq def2-TZVPP def2/J RIJCOSX TightSCF defgrid3 CPCM(Acetonitrile)
frequency: 0.00 0.00 0.00 0.00 0.00 0.00 11.31 12.50 13.27 14.18 16.16 16.99 18.09 19.05 22.03 23.40 29.53 31.99 39.11 40.98 46.11 53.09 59.27 60.26 65.82 70.46 75.72 78.01 85.17 91.21 96.01 100.31 102.73 104.98 110.84 117.52 125.46 129.86 130.82 137.63 143.53 146.31 148.74 153.33 158.48 159.49 165.56 173.11 185.11 191.58 195.39 205.72 210.91 215.70 217.10 220.60 223.24 228.63 252.64 256.03 263.46 271.48 274.04 278.14 278.94 285.74 294.01 301.59 305.04 306.69 311.32 314.21 322.62 343.02 359.47 372.27 376.95 408.83 413.12 419.58 420.70 428.11 434.51 439.53 444.80 446.95 449.79 453.24 455.61 458.21 464.76 469.28 475.10 491.50 493.10 493.69 494.64 495.46 496.20 507.53 514.68 579.62 580.76 587.80 590.66 593.67 596.24 614.36 621.09 641.41 643.10 650.10 658.63 675.85 693.22 694.51 695.12 697.18 699.00 711.68 738.75 743.94 751.87 759.33 760.85 761.00 763.13 765.15 765.61 765.96 788.86 796.09 801.83 805.80 817.37 821.52 824.57 827.26 858.49 899.56 902.18 934.45 959.39 961.16 969.83 980.07 988.75 1016.23 1017.52 1018.90 1020.62 1044.28 1045.25 1048.06 1049.56 1049.73 1054.29 1055.50 1058.22 1090.17 1091.69 1098.11 1099.39 1100.37 1103.98 1104.55 1127.67 1130.47 1147.73 1149.42 1151.58 1153.16 1154.42 1160.50 1163.38 1167.36 1173.50 1230.08 1258.96 1284.64 1292.87 1298.99 1306.49 1324.55 1352.20 1363.11 1377.86 1382.61 1383.76 1387.21 1389.39 1391.47 1425.44 1457.74 1463.12 1474.22 1479.65 1524.06 1548.02 1567.16 1578.95 1581.48 1606.43 1612.63 1615.13 1619.65 1626.60 1628.43 1632.03 1634.22 1660.73 3072.95 3127.31 3163.00 3163.56 3174.28 3174.99 3179.59 3183.77 3187.86 3189.52 3205.10 3216.63 3254.92 3721.29
frequency: 11.31 12.50 13.27 14.18 16.16 16.99 18.09 19.05 22.03 23.40 29.53 31.99 39.11 40.98 46.11 53.09 59.27 60.26 65.82 70.46 75.72 78.01 85.17 91.21 96.01 100.31 102.73 104.98 110.84 117.52 125.46 129.86 130.82 137.63 143.53 146.31 148.74 153.33 158.48 159.49 165.56 173.11 185.11 191.58 195.39 205.72 210.91 215.70 217.10 220.60 223.24 228.63 252.64 256.03 263.46 271.48 274.04 278.14 278.94 285.74 294.01 301.59 305.04 306.69 311.32 314.21 322.62 343.02 359.47 372.27 376.95 408.83 413.12 419.58 420.70 428.11 434.51 439.53 444.80 446.95 449.79 453.24 455.61 458.21 464.76 469.28 475.10 491.50 493.10 493.69 494.64 495.46 496.20 507.53 514.68 579.62 580.76 587.80 590.66 593.67 596.24 614.36 621.09 641.41 643.10 650.10 658.63 675.85 693.22 694.51 695.12 697.18 699.00 711.68 738.75 743.94 751.87 759.33 760.85 761.00 763.13 765.15 765.61 765.96 788.86 796.09 801.83 805.80 817.37 821.52 824.57 827.26 858.49 899.56 902.18 934.45 959.39 961.16 969.83 980.07 988.75 1016.23 1017.52 1018.90 1020.62 1044.28 1045.25 1048.06 1049.56 1049.73 1054.29 1055.50 1058.22 1090.17 1091.69 1098.11 1099.39 1100.37 1103.98 1104.55 1127.67 1130.47 1147.73 1149.42 1151.58 1153.16 1154.42 1160.50 1163.38 1167.36 1173.50 1230.08 1258.96 1284.64 1292.87 1298.99 1306.49 1324.55 1352.20 1363.11 1377.86 1382.61 1383.76 1387.21 1389.39 1391.47 1425.44 1457.74 1463.12 1474.22 1479.65 1524.06 1548.02 1567.16 1578.95 1581.48 1606.43 1612.63 1615.13 1619.65 1626.60 1628.43 1632.03 1634.22 1660.73 3072.95 3127.31 3163.00 3163.56 3174.28 3174.99 3179.59 3183.77 3187.86 3189.52 3205.10 3216.63 3254.92 3721.29
formula: C26H14CuF15N5Ni2O12
InChI: InChI=1/C16H11N5.5C2F3O2.Cu.2Ni.H2O.HO/c1-3-8-17-12(5-1)14-7-10-21-11-15(20-16(21)19-14)13-6-2-4-9-18-13;5*3-2(4,5)1(6)7;;;;;/h1-11H;;;;;;;;;1H2;1H/q-4;3*-2;2*-1;+3;+4;+5;;/rC26H14CuF15N5Ni2O12/c28-22(29,30)16(50)54-48-45-9-4-2-6-13(45)14-7-10-43-11-15-12-5-1-3-8-44(12)27(46(15)21(43)47(14)48)53-18(24(34,35)36)58-49(52,61(27)48,55-17(51)23(31,32)33,59-19(56-48)25(37,38)39)60-20(57-48)26(40,41)42/h1-11,61H,52H2
75 atoms
Cu 11.04903 4.775883 18.08039
Ni 9.591396 8.041828 18.143038
Ni 8.278159 5.131342 19.406693
N  9.331394 9.971147 17.470035
N  10.775146 8.039041 16.448148
N  11.545053 5.766884 16.452007
N  12.087954 7.043466 14.709386
N  12.117409 3.327923 17.158276
C  8.604454 10.911754 18.081724
H  8.088191 10.596354 18.980596
C  8.515294 12.215797 17.596512
H  7.912083 12.945397 18.124503
C  9.210603 12.549794 16.438202
H  9.167484 13.555664 16.034976
C  9.969038 11.572566 15.799047
H  10.522985 11.812466 14.89996
C  10.008417 10.286637 16.340901
C  10.769506 9.18073 15.744988
C  11.439889 9.285934 14.500707
H  11.4305 10.207996 13.937188
C  12.097626 8.204898 13.988557
H  12.627339 8.194156 13.045007
C  11.417489 6.985841 15.941137
C  12.644999 5.806603 14.471088
H  13.220363 5.600382 13.583175
C  12.302185 5.036561 15.559873
C  12.604317 3.667996 15.9379
C  13.326266 2.764405 15.160754
H  13.702096 3.063049 14.188773
C  13.54998 1.484943 15.660078
H  14.10851 0.762417 15.074849
C  13.050132 1.144373 16.916146
H  13.204619 0.158198 17.337807
C  12.336029 2.096097 17.637027
H  11.924782 1.886318 18.616888
O  9.933172 6.169104 18.875361
H  10.389968 6.436681 19.726271
O  11.367513 3.908814 19.842237
O  9.342549 4.136057 20.86717
C  10.53863 3.794368 20.789102
C  11.154088 3.115301 22.049649
F  11.661948 1.894679 21.742229
F  10.255417 2.945135 23.039336
F  12.172383 3.865446 22.543848
O  6.948485 5.893698 18.047234
O  8.08653 7.466427 16.853171
C  7.155811 6.65921 17.076189
C  6.092455 6.542075 15.941949
F  6.356372 5.442295 15.180339
F  6.084487 7.610219 15.114553
F  4.838679 6.398247 16.432285
O  8.315546 8.421955 19.723022
O  7.732642 6.499848 20.813284
C  7.8298 7.739924 20.657078
C  7.265757 8.613705 21.81975
F  6.357265 9.512225 21.358415
F  6.662388 7.889809 22.785784
F  8.267281 9.321829 22.407953
O  11.145802 8.801342 19.30889
O  11.195567 7.22701 20.950758
C  11.492629 8.317936 20.424122
C  12.416608 9.277462 21.237225
F  13.481503 9.690243 20.500704
F  12.90348 8.711017 22.36335
F  11.732513 10.394352 21.611683
O  8.887996 3.81492 17.921586
O  7.059855 2.484623 17.762814
C  8.141687 2.949596 17.366594
C  8.689064 2.393987 16.015415
F  9.371233 3.327376 15.309244
F  9.540043 1.354817 16.241729
F  7.698072 1.93358 15.220167
O  6.642201 3.929829 19.96541
H  5.846735 4.473977 19.846155
H  6.6452 3.301716 19.186197
elementType: Cu Ni N C H O F
totalener: -8333.11725335138908 hartree
cpcmener: -0.09249320635637 hartree
kineticenergy: 8311.70341613076744 hartree
exchangeener: -616.564187356433 hartree
correlationener: -19.137096076803 hartree
xcener: -635.701283433236 hartree
s2: 8.759217
energy: -8766.7812 -8135.9082 -8135.7875 -1047.1520 -963.6077 -963.4420 -917.1176 -917.0735 -916.8386 -839.4298 -839.4208 -839.3687 -839.2605 -839.2508 -839.2143 -665.3097 -665.2965 -665.2894 -665.2583 -665.2497 -665.2387 -665.2377 -665.2289 -665.2226 -665.2220 -665.2094 -665.2027 -665.1540 -665.1421 -665.1389 -514.5248 -514.3870 -514.3441 -514.2790 -514.2165 -514.1856 -514.1365 -514.1326 -514.0790 -513.9234 -513.8516 -513.6779 -387.0620 -385.4939 -385.2972 -385.1378 -385.0350 -278.6146 -278.5093 -278.4938 -278.4773 -278.3634 -275.6788 -275.4875 -275.4753 -275.4561 -275.4513 -275.2096 -274.3403 -274.2785 -273.9332 -273.8096 -273.8093 -273.6899 -273.4525 -273.3174 -273.0266 -272.8231 -272.7682 -272.7523 -272.7427 -272.5889 -272.5875 -115.5909 -107.2636 -107.1484 -75.4845 -75.2921 -74.3061 -69.4155 -69.3593 -69.2745 -69.2642 -69.2584 -69.1775 -33.6746 -33.6091 -33.5857 -33.5687 -33.4858 -31.4601 -31.4115 -31.3904 -31.3792 -31.3608 -31.3596 -31.3278 -31.3120 -31.2811 -31.2390 -28.0316 -27.9090 -27.8154 -27.7284 -27.6850 -27.4592 -26.0803 -25.9261 -25.7153 -25.6532 -25.4873 -25.4864 -25.3138 -25.2395 -24.8966 -24.6888 -24.4068 -21.2756 -21.0498 -21.0016 -20.7269 -20.4377 -19.4138 -18.6698 -18.5507 -18.5339 -18.5053 -18.3857 -18.0726 -17.6193 -17.1921 -16.6555 -16.5051 -16.1572 -15.9368 -15.8339 -15.7801 -15.7464 -15.6430 -15.6124 -14.8368 -14.8234 -14.7826 -14.7511 -14.7485 -14.7367 -14.7324 -14.7155 -14.7130 -14.6570 -14.6238 -14.1541 -13.9891 -13.5192 -13.5059 -13.3669 -13.3338 -13.1957 -13.1062 -13.0418 -12.9826 -12.8320 -12.6849 -12.6388 -12.4309 -12.3865 -12.3119 -12.2274 -12.1627 -12.0565 -11.8605 -11.7654 -11.7543 -11.6372 -11.5886 -11.5224 -11.5017 -11.4267 -11.4183 -11.3643 -11.3465 -11.3331 -11.3144 -11.2910 -11.2677 -11.2313 -11.1877 -11.1341 -11.0890 -11.0443 -10.9736 -10.9226 -10.8959 -10.8452 -10.7959 -10.7764 -10.6975 -10.6414 -10.5502 -10.4591 -10.4097 -10.3909 -10.3777 -10.3656 -10.3383 -10.3162 -10.2711 -10.2644 -10.2406 -10.1687 -10.1280 -10.0542 -9.9560 -9.9315 -9.8924 -9.8839 -9.8338 -9.8138 -9.7835 -9.7651 -9.7544 -9.6749 -9.6329 -9.3164 -8.8339 -8.6979 -8.6052 -8.5838 -8.4789 -8.3665 -8.2696 -8.1786 -8.1552 -8.0716 -8.0013 -7.9368 -7.8232 -7.7181 -7.6764 -7.5723 -7.4939 -7.4693 -7.3792 -7.3745 -7.2844 -7.2722 -7.2404 -7.0948 -6.9440 -6.8298 -6.7242 -6.6950 -6.5852 -6.5222 -6.4729 -6.4109 -6.3054 -6.2017 -5.9218 -5.7259 -5.4932 -5.3895 -5.1992 -3.6976 -2.6610 -2.3119 -2.1247 -1.8655 -1.5631 -1.4222 -1.3373 -1.2407 -1.1227 -1.0208 electronvolt
energy: -8766.7758 -8135.8945 -8135.7738 -1046.7623 -962.6801 -962.5093 -916.7174 -916.6841 -916.6777 -838.6643 -838.6604 -838.6297 -838.4958 -838.4878 -838.4644 -665.3075 -665.2954 -665.2882 -665.2584 -665.2499 -665.2370 -665.2364 -665.2274 -665.2215 -665.2204 -665.2084 -665.2016 -665.1520 -665.1423 -665.1385 -514.4611 -514.3347 -514.2954 -514.2307 -514.1599 -514.1295 -514.0865 -514.0826 -513.8652 -513.8646 -513.8517 -513.6766 -387.0539 -385.4398 -385.2311 -385.0762 -384.9767 -278.6026 -278.5047 -278.4822 -278.4654 -278.3574 -275.6828 -275.4870 -275.4775 -275.4569 -275.4532 -275.2105 -274.3436 -274.2811 -273.9334 -273.8096 -273.8090 -273.6893 -273.4534 -273.3199 -273.0243 -272.8251 -272.7702 -272.7511 -272.7402 -272.5853 -272.5829 -114.7219 -105.0906 -104.9536 -74.2737 -74.2328 -74.0217 -67.2292 -67.2080 -67.1423 -67.0797 -67.0778 -67.0239 -33.6705 -33.6075 -33.5820 -33.5649 -33.4837 -31.4565 -31.4092 -31.3890 -31.3763 -31.3603 -31.3566 -31.3256 -31.3098 -31.2788 -31.2385 -27.9542 -27.8794 -27.7499 -27.6731 -27.6350 -27.4177 -26.0008 -25.8258 -25.6297 -25.5638 -25.4431 -25.4324 -25.2457 -25.1803 -24.6347 -24.5500 -24.3542 -21.2638 -21.0305 -20.9880 -20.7057 -20.4286 -19.4042 -18.6325 -18.5272 -18.5092 -18.4713 -18.3671 -18.0532 -17.6006 -17.1686 -16.6371 -16.4859 -16.1381 -15.9024 -15.8024 -15.7603 -15.7093 -15.6149 -15.5897 -14.8317 -14.8105 -14.7803 -14.7454 -14.7422 -14.7309 -14.7226 -14.7027 -14.6865 -14.6545 -14.6181 -14.1190 -13.9634 -13.4850 -13.4642 -13.3155 -13.2655 -13.1415 -13.0532 -13.0021 -12.9444 -12.7379 -12.6199 -12.5869 -12.3681 -12.3065 -12.1864 -12.1371 -12.0324 -12.0097 -11.8096 -11.7231 -11.6869 -11.6134 -11.5644 -11.5086 -11.4897 -11.4155 -11.4097 -11.3550 -11.3413 -11.3239 -11.2788 -11.2662 -11.2162 -11.1993 -11.1403 -11.0951 -11.0680 -10.9428 -10.9020 -10.8871 -10.7939 -10.7772 -10.7444 -10.6452 -10.6010 -10.5797 -10.4994 -10.4476 -10.3862 -10.3763 -10.3531 -10.3231 -10.2893 -10.2619 -10.2185 -10.1658 -10.1162 -10.0602 -10.0148 -10.0100 -9.9290 -9.8910 -9.8773 -9.8322 -9.8120 -9.7541 -9.7356 -9.6695 -9.6363 -9.4614 -9.1704 -8.9460 -8.4778 -8.2979 -8.2489 -8.2294 -8.2168 -8.1216 -8.0481 -8.0065 -7.9239 -7.8460 -7.7644 -7.7088 -7.5871 -7.5055 -7.4131 -7.3605 -7.3224 -7.3047 -7.2379 -7.1956 -7.1795 -7.1186 -7.0223 -6.9495 -6.7298 -6.6240 -6.3283 -6.1912 -5.8909 -5.8699 -5.7975 -5.6703 -5.6559 -5.5866 -4.2823 -3.6655 -3.0372 -2.8543 -2.8281 -2.6683 -2.6253 -2.2992 -2.1078 -1.8518 -1.5360 electronvolt
chargesum: -0.0000000
charge: 0.429429 0.829178 0.926416 -0.106989 -0.131801 -0.121457 0.108679 -0.098330 0.027196 0.119013 -0.072021 0.121357 -0.039274 0.128118 -0.095579 0.094775 0.132669 0.194002 -0.072942 0.107010 0.011473 0.143093 0.163575 -0.078071 0.147761 0.290441 0.091011 -0.129133 0.103491 -0.033690 0.125713 -0.075279 0.121601 0.044614 0.111320 -0.817704 0.343765 -0.433993 -0.393478 0.372303 0.404063 -0.152513 -0.146339 -0.154283 -0.442025 -0.420083 0.320529 0.395757 -0.159977 -0.152746 -0.153916 -0.493811 -0.417476 0.336154 0.412628 -0.160000 -0.151130 -0.163351 -0.453399 -0.465966 0.295107 0.403035 -0.160969 -0.154737 -0.163970 -0.484486 -0.428710 0.270969 0.462512 -0.163903 -0.167094 -0.153408 -0.428161 0.257483 0.245958
charge: -0.055608 -0.195675 -0.189510 0.297203 0.300146 0.260168 0.368974 0.285811 -0.024393 0.022098 0.025320 0.034018 0.042916 0.036412 0.047275 0.034629 -0.112011 -0.090209 0.032725 0.041865 0.044173 0.046344 -0.227596 0.021411 0.030031 -0.130361 -0.112182 0.046971 0.039028 0.046619 0.037238 0.020375 0.034257 -0.019187 0.031312 0.233262 -0.171985 0.177487 0.197469 -0.499399 -0.623215 0.186664 0.200639 0.185802 0.176068 0.181506 -0.515032 -0.620526 0.177062 0.191174 0.187932 0.186985 0.178055 -0.515664 -0.620282 0.181809 0.194417 0.179948 0.143225 0.088703 -0.557871 -0.623392 0.177337 0.189164 0.173742 0.202828 0.093725 -0.532028 -0.618064 0.201082 0.185550 0.192787 0.390038 -0.079180 -0.148409
qa: 0.4294 0.8292 0.9264 -0.1070 -0.1318 -0.1215 0.1087 -0.0983 0.0272 0.1190 -0.0720 0.1214 -0.0393 0.1281 -0.0956 0.0948 0.1327 0.1940 -0.0729 0.1070 0.0115 0.1431 0.1636 -0.0781 0.1478 0.2904 0.0910 -0.1291 0.1035 -0.0337 0.1257 -0.0753 0.1216 0.0446 0.1113 -0.8177 0.3438 -0.4340 -0.3935 0.3723 0.4041 -0.1525 -0.1463 -0.1543 -0.4420 -0.4201 0.3205 0.3958 -0.1600 -0.1527 -0.1539 -0.4938 -0.4175 0.3362 0.4126 -0.1600 -0.1511 -0.1634 -0.4534 -0.4660 0.2951 0.4030 -0.1610 -0.1547 -0.1640 -0.4845 -0.4287 0.2710 0.4625 -0.1639 -0.1671 -0.1534 -0.4282 0.2575 0.2460
va: 2.4569 3.3829 3.2438 3.1101 3.0370 3.2034 3.5393 3.2632 4.0007 1.0240 3.9185 0.9993 3.9106 0.9960 3.9512 1.0167 3.8250 3.9043 3.8698 1.0151 3.9185 0.9999 4.1284 3.9275 1.0023 3.6422 3.8450 3.9639 1.0123 3.9168 0.9975 3.9323 1.0001 3.9922 1.0226 1.6275 0.9506 2.0741 2.0566 4.0848 4.5567 1.1550 1.1719 1.1531 2.0283 2.0209 4.1874 4.5511 1.1406 1.1606 1.1575 1.9525 2.0391 4.1653 4.5139 1.1451 1.1660 1.1431 1.9692 2.0363 4.1959 4.5480 1.1412 1.1589 1.1346 1.8737 2.0933 4.3014 4.4373 1.1421 1.1375 1.1653 2.0666 0.9897 1.0665
dispersion: -0.161352467 hartree
energy: -8333.278605818159 hartree
dipole: 16.913103995 -10.554507030 6.358596965 13.715350051 -11.010110909 2.705239143 -38.546452740 27.519959433 -11.026493307
dipolemethod: SCF
magnitude: 13.012825551 au
magnitude: 33.075973961 debye
temp: 298.15 k
press: 1.00 atm
zeropoint: 0.42074582 hartree
thermalvibcorrection: 0.05774544 hartree
thermalrotcorrection: 0.00141627 hartree
thermaltrasncorrection: 0.00141627 hartree
thermaltotal: -8332.79728201 hartree
thermalcorr: 0.06057798 hartree
nonthermalcorr: 0.42074582 hartree
totalcorr: 0.48132381 hartree
thermalcorrenthalpy: 0.00094421 hartree
totalenthalpy: -8332.79633780 hartree
vibrat: 0.10835318 hartree
rotat: 0.01893276 hartree
transl: 0.02220727 hartree
total: 0.15118496 hartree
totalentropycorr: -0.15118496 hartree
gibbsenthalpy: -8332.94752276 hartree
gibbsminuselec: 0.33108306 hartree
