program: Orca
programVersion: 6.0.1
elementType: Co Co Co N N N N N O O O O O O O O O O O C C C C C C C C C H C C C H C H C H C H C H C H C H C H C C H C C C C H F F F F F F F F F F F F O H H O H H C F F F H
charge: 0
multiplicity: 10
keywords: TPSS D3BJ Freq def2-TZVPP def2/J RIJCOSX TightSCF defgrid3 CPCM(Acetonitrile)
frequency: 0.00 0.00 0.00 0.00 0.00 0.00 9.96 10.96 11.64 13.41 14.54 16.63 17.45 18.04 20.21 25.28 25.82 27.71 32.21 40.30 48.79 51.47 54.58 61.80 68.34 72.73 73.79 78.36 82.45 85.68 89.77 93.81 101.78 103.40 105.07 107.93 109.98 121.14 122.91 127.03 129.33 136.37 137.48 141.45 143.55 152.36 158.44 161.81 166.78 173.34 175.48 182.35 184.01 185.43 189.85 191.52 202.24 206.86 212.63 220.29 223.22 230.18 251.48 253.12 255.37 258.76 262.85 264.14 270.98 271.99 274.92 288.51 296.77 301.71 303.39 305.72 311.29 338.73 340.66 349.22 357.76 368.03 374.77 412.04 413.94 416.86 422.64 426.69 432.58 437.48 441.21 444.19 448.97 450.49 451.55 455.56 456.44 467.57 492.70 493.21 493.26 493.39 493.80 494.33 496.29 508.06 537.77 553.74 577.10 584.10 584.83 587.23 588.36 589.97 609.71 633.62 640.20 649.83 655.48 680.19 690.08 692.81 693.32 695.11 696.43 709.31 717.33 737.10 742.84 752.65 760.11 761.79 762.61 763.52 764.11 765.26 775.41 788.39 798.25 799.87 814.86 815.69 818.08 821.17 821.97 851.50 900.98 902.88 948.22 949.89 953.53 963.08 987.37 990.32 1012.75 1014.68 1014.79 1016.61 1034.84 1047.06 1047.58 1048.19 1048.76 1049.34 1053.25 1057.00 1088.12 1093.55 1095.90 1096.42 1096.92 1097.03 1099.81 1124.36 1128.81 1149.47 1149.82 1151.77 1152.88 1154.96 1160.93 1163.93 1171.92 1231.30 1258.00 1281.43 1292.10 1295.86 1301.66 1318.34 1346.43 1356.49 1384.78 1389.27 1390.74 1391.72 1393.70 1394.60 1417.27 1453.44 1459.70 1473.14 1478.48 1517.22 1542.92 1557.68 1576.44 1578.85 1592.96 1605.69 1607.49 1611.92 1613.03 1622.65 1625.21 1628.51 1636.30 1653.39 3158.31 3161.96 3169.46 3173.40 3175.32 3182.11 3183.33 3188.54 3202.34 3217.47 3251.25 3318.89 3395.03 3667.42 3728.61 3746.25
frequency: 9.96 10.96 11.64 13.41 14.54 16.63 17.45 18.04 20.21 25.28 25.82 27.71 32.21 40.30 48.79 51.47 54.58 61.80 68.34 72.73 73.79 78.36 82.45 85.68 89.77 93.81 101.78 103.40 105.07 107.93 109.98 121.14 122.91 127.03 129.33 136.37 137.48 141.45 143.55 152.36 158.44 161.81 166.78 173.34 175.48 182.35 184.01 185.43 189.85 191.52 202.24 206.86 212.63 220.29 223.22 230.18 251.48 253.12 255.37 258.76 262.85 264.14 270.98 271.99 274.92 288.51 296.77 301.71 303.39 305.72 311.29 338.73 340.66 349.22 357.76 368.03 374.77 412.04 413.94 416.86 422.64 426.69 432.58 437.48 441.21 444.19 448.97 450.49 451.55 455.56 456.44 467.57 492.70 493.21 493.26 493.39 493.80 494.33 496.29 508.06 537.77 553.74 577.10 584.10 584.83 587.23 588.36 589.97 609.71 633.62 640.20 649.83 655.48 680.19 690.08 692.81 693.32 695.11 696.43 709.31 717.33 737.10 742.84 752.65 760.11 761.79 762.61 763.52 764.11 765.26 775.41 788.39 798.25 799.87 814.86 815.69 818.08 821.17 821.97 851.50 900.98 902.88 948.22 949.89 953.53 963.08 987.37 990.32 1012.75 1014.68 1014.79 1016.61 1034.84 1047.06 1047.58 1048.19 1048.76 1049.34 1053.25 1057.00 1088.12 1093.55 1095.90 1096.42 1096.92 1097.03 1099.81 1124.36 1128.81 1149.47 1149.82 1151.77 1152.88 1154.96 1160.93 1163.93 1171.92 1231.30 1258.00 1281.43 1292.10 1295.86 1301.66 1318.34 1346.43 1356.49 1384.78 1389.27 1390.74 1391.72 1393.70 1394.60 1417.27 1453.44 1459.70 1473.14 1478.48 1517.22 1542.92 1557.68 1576.44 1578.85 1592.96 1605.69 1607.49 1611.92 1613.03 1622.65 1625.21 1628.51 1636.30 1653.39 3158.31 3161.96 3169.46 3173.40 3175.32 3182.11 3183.33 3188.54 3202.34 3217.47 3251.25 3318.89 3395.03 3667.42 3728.61 3746.25
formula: C26H16Co3F15N5O13
InChI: InChI=1/C16H11N5.5C2F3O2.3Co.2H2O.HO/c1-3-8-17-12(5-1)14-7-10-21-11-15(20-16(21)19-14)13-6-2-4-9-18-13;5*3-2(4,5)1(6)7;;;;;;/h1-11H;;;;;;;;;2*1H2;1H/q-4;4*-2;-1;2*+4;+5;;;/rC26H12Co3F15N5O11.2H2O/c30-22(31,32)16(50)57-29-47-9-4-2-6-13(47)14-7-10-45-11-15-12-5-1-3-8-46(12)27(48(15)21(45)49(14)29)51-17(23(33,34)35)53-28(60(27)29,54-18(52-27)24(36,37)38,55-19(58-29)25(39,40)41)56-20(59-29)26(42,43)44;;/h1-11,60H;2*1H2
78 atoms
Co 8.206582 11.58079 13.649323
Co 8.354108 9.855657 10.664951
Co 8.36308 7.938387 13.47511
N  8.522365 13.436679 14.595374
N  8.733478 6.123729 14.531124
N  9.07423 8.641139 15.310862
N  9.883335 9.534464 17.196906
N  9.121767 11.037156 15.486672
O  7.866353 9.775426 12.693442
O  6.828023 11.235749 10.316094
O  9.984557 8.579179 10.633526
O  7.244178 12.615966 12.076825
O  9.7400 11.403583 10.655225
O  7.663116 6.803967 11.855294
O  10.330328 7.936328 12.787124
O  6.285353 11.546172 14.563297
O  10.13414 11.770729 12.864141
O  7.089407 8.256097 10.202307
O  5.189684 10.052117 13.246634
C  10.646259 8.099372 11.581753
C  6.690812 12.274481 11.005505
C  9.181566 13.401008 15.776842
C  5.272764 10.948449 14.123704
C  7.121356 7.140712 10.777633
C  9.451774 7.642835 16.184124
C  10.384859 11.842024 11.633983
C  9.45527 12.055965 16.295543
C  8.221391 14.624066 14.052512
H  7.691527 14.586776 13.108279
C  9.273757 6.263034 15.765264
C  9.3333 9.789698 15.925246
C  8.529413 4.887067 14.05093
H  8.09654 4.834658 13.058673
C  9.561736 14.571412 16.439148
H  10.098559 14.529293 17.378478
C  9.621823 5.16228 16.551358
H  10.052224 5.309641 17.535407
C  8.565681 15.830805 14.656288
H  8.300047 16.766849 14.17849
C  9.956442 8.173048 17.353914
H  10.346284 7.722335 18.252379
C  9.249832 15.801569 15.868754
H  9.539288 16.721044 16.365992
C  8.851617 3.742972 14.774257
H  8.668635 2.764869 14.344259
C  10.019991 11.838708 17.578031
H  10.278655 12.666309 18.222624
C  12.096047 7.638791 11.24668
C  9.406674 3.884948 16.046179
H  9.668751 3.01306 16.636109
C  6.330923 6.022908 10.032381
C  3.908624 11.361288 14.759542
C  5.674715 13.32739 10.467834
C  10.228999 10.5666 18.022744
H  10.645826 10.308432 18.98748
F  6.541009 4.793426 10.550733
F  4.017269 12.361962 15.660394
F  3.034407 11.770965 13.803284
F  4.993677 6.268386 10.100998
F  6.2942 14.514862 10.231941
F  4.694371 13.561135 11.379745
F  3.338933 10.30295 15.397136
F  12.387547 7.719311 9.930965
F  13.001244 8.40867 11.910151
F  5.074901 12.950965 9.318432
F  12.304916 6.353174 11.63123
F  6.663125 5.971644 8.718176
O  8.472287 9.911325 8.49344
H  7.953029 10.677636 8.19658
H  7.967348 9.137846 8.189126
O  6.284315 7.712837 14.204993
H  5.917337 6.918848 13.783632
H  5.744768 8.460977 13.854922
C  11.709665 12.594527 11.310958
F  11.950193 12.702206 9.9872
F  11.690685 13.852847 11.824284
F  12.771643 11.950665 11.865624
H  6.877794 9.80462 12.679746
elementType: Co N O C H F
totalener: -7900.81291970748680 hartree
cpcmener: -0.07904096973300 hartree
kineticenergy: 7879.87389441786218 hartree
exchangeener: -610.538182784042 hartree
correlationener: -19.179684132468 hartree
xcener: -629.717866916510 hartree
s2: 24.776015
energy: -7528.9255 -7528.8108 -7528.7922 -882.5063 -882.3626 -882.3344 -764.6449 -764.5076 -764.4951 -764.4674 -764.4157 -764.3303 -764.3291 -764.2869 -764.2484 -665.2506 -665.2319 -665.2290 -665.2278 -665.2246 -665.2218 -665.2123 -665.2115 -665.2102 -665.2077 -665.2073 -665.2044 -665.2013 -665.1895 -665.1873 -514.6981 -514.4364 -514.1259 -514.1154 -514.1111 -514.0995 -514.0950 -514.0436 -514.0421 -514.0258 -514.0136 -513.8304 -513.5698 -386.8304 -385.2521 -384.8480 -384.7643 -384.6449 -278.4915 -278.4719 -278.4699 -278.4572 -278.4243 -275.4906 -275.4478 -275.4428 -275.4395 -275.3994 -275.2141 -274.1482 -274.1061 -273.7137 -273.6592 -273.5484 -273.4601 -273.2416 -273.1804 -272.8696 -272.7139 -272.6685 -272.6521 -272.5557 -272.5089 -272.4121 -96.3770 -96.2448 -96.2438 -61.1853 -61.0529 -61.0295 -61.0125 -60.9558 -60.9132 -60.8603 -60.8477 -60.8243 -33.5903 -33.5700 -33.5668 -33.5630 -33.5397 -31.3817 -31.3630 -31.3590 -31.3551 -31.3375 -31.3313 -31.3175 -31.3130 -31.3105 -31.2927 -27.7714 -27.7173 -27.6559 -27.6232 -27.6163 -27.5671 -26.4336 -26.1598 -25.5954 -25.5548 -25.5285 -25.4983 -25.3760 -25.2185 -24.8764 -24.4588 -24.3510 -24.0901 -21.0784 -20.9054 -20.8270 -20.5239 -20.2398 -19.2086 -18.5357 -18.5109 -18.4904 -18.4755 -18.4421 -17.8501 -17.4129 -16.9358 -16.4555 -16.3541 -15.9682 -15.8030 -15.7607 -15.7250 -15.7005 -15.6646 -15.3990 -14.7573 -14.7473 -14.7331 -14.7322 -14.7285 -14.7144 -14.7104 -14.7015 -14.6983 -14.6742 -14.4910 -13.9720 -13.8138 -13.7566 -13.6758 -13.2397 -13.1861 -13.0880 -12.9477 -12.9138 -12.8730 -12.8008 -12.7348 -12.4772 -12.4231 -12.2451 -12.0861 -12.0615 -11.9716 -11.9397 -11.8790 -11.8080 -11.6722 -11.6061 -11.5720 -11.5245 -11.4808 -11.4253 -11.4013 -11.3825 -11.3443 -11.3343 -11.3206 -11.3137 -11.2313 -11.2088 -11.1283 -11.0812 -10.9890 -10.9643 -10.9094 -10.8482 -10.8090 -10.7313 -10.6635 -10.6402 -10.5669 -10.5257 -10.4975 -10.4716 -10.4313 -10.3791 -10.3555 -10.3514 -10.3381 -10.3365 -10.3190 -10.2502 -10.2077 -10.1866 -10.1416 -10.0699 -10.0307 -9.8397 -9.8277 -9.8149 -9.8094 -9.8020 -9.7920 -9.5609 -9.5076 -9.4597 -9.2580 -9.0009 -8.8250 -8.6798 -8.4719 -8.2973 -8.1817 -8.0434 -7.9687 -7.9479 -7.8250 -7.8085 -7.7378 -7.7045 -7.6143 -7.5331 -7.4539 -7.3760 -7.3659 -7.2890 -7.2579 -7.2329 -7.1840 -7.1741 -7.1368 -7.1294 -6.9001 -6.8401 -6.0635 -5.1739 -5.1039 -5.0504 -5.0219 -4.9535 -4.8682 -3.6132 -3.4973 -3.4919 -3.4041 -2.4320 -2.3022 -2.1563 -2.1196 -2.0528 -1.9958 -1.9281 electronvolt
chargesum: -0.0000000
charge: 0.944817 0.913575 0.924506 -0.146532 -0.190938 -0.210730 0.104582 -0.190625 -0.917357 -0.436677 -0.433149 -0.503712 -0.430957 -0.467578 -0.469666 -0.437594 -0.464878 -0.448953 -0.512663 0.337716 0.358916 0.151645 0.326445 0.341267 0.204868 0.342045 0.189432 0.024081 0.118850 0.087532 0.170859 0.021671 0.115241 -0.104208 0.092603 -0.119095 0.096558 -0.083955 0.119252 -0.087785 0.142437 -0.037656 0.126900 -0.084105 0.117212 -0.080420 0.103099 0.393895 -0.039239 0.122871 0.393964 0.399842 0.408368 0.006090 0.139357 -0.149559 -0.154157 -0.158742 -0.158742 -0.161404 -0.162554 -0.160141 -0.152436 -0.160623 -0.151846 -0.158386 -0.155473 -0.379026 0.264905 0.260620 -0.437156 0.256614 0.263433 0.393664 -0.151742 -0.158830 -0.159279 0.288838
charge: -0.125604 -0.127106 -0.126398 0.283277 0.277613 0.257558 0.363851 0.284263 0.191994 0.157918 0.175671 0.176479 0.174256 0.174953 0.161568 0.150999 0.159821 0.157178 0.080457 -0.517031 -0.520723 -0.115411 -0.554075 -0.516191 -0.139223 -0.516893 -0.099845 -0.028872 0.020304 -0.121904 -0.240508 -0.036461 0.020232 0.043306 0.032981 0.038168 0.035517 0.020114 0.032852 0.007759 0.026543 0.040348 0.035583 0.011244 0.030824 0.024906 0.039411 -0.621370 0.035931 0.034236 -0.620713 -0.625606 -0.619994 0.034262 0.043815 0.193995 0.190449 0.180236 0.178536 0.179775 0.181512 0.177455 0.193519 0.178528 0.193228 0.181691 0.184601 0.412411 -0.067448 -0.069524 0.393749 -0.076001 -0.131969 -0.621360 0.194083 0.180769 0.179684 -0.170184
qa: 0.9448 0.9136 0.9245 -0.1465 -0.1909 -0.2107 0.1046 -0.1906 -0.9174 -0.4367 -0.4331 -0.5037 -0.4310 -0.4676 -0.4697 -0.4376 -0.4649 -0.4490 -0.5127 0.3377 0.3589 0.1516 0.3264 0.3413 0.2049 0.3420 0.1894 0.0241 0.1189 0.0875 0.1709 0.0217 0.1152 -0.1042 0.0926 -0.1191 0.0966 -0.0840 0.1193 -0.0878 0.1424 -0.0377 0.1269 -0.0841 0.1172 -0.0804 0.1031 0.3939 -0.0392 0.1229 0.3940 0.3998 0.4084 0.0061 0.1394 -0.1496 -0.1542 -0.1587 -0.1587 -0.1614 -0.1626 -0.1601 -0.1524 -0.1606 -0.1518 -0.1584 -0.1555 -0.3790 0.2649 0.2606 -0.4372 0.2566 0.2634 0.3937 -0.1517 -0.1588 -0.1593 0.2888
va: 4.3154 4.4050 4.3070 3.1006 3.1001 2.9682 3.5263 3.0412 1.5031 1.9923 2.0143 1.9507 2.0181 1.9556 1.9696 1.9685 1.9767 1.9861 1.9766 4.1483 4.1488 3.8035 4.1442 4.1735 3.8099 4.1407 3.9013 4.0076 1.0267 3.8712 4.1238 4.0101 1.0217 3.9592 1.0175 3.9553 1.0138 3.9250 1.0000 3.9334 1.0039 3.9058 0.9960 3.9214 1.0010 3.8742 1.0161 4.5629 3.9025 0.9984 4.5503 4.5590 4.5204 3.9206 1.0013 1.1608 1.1584 1.1451 1.1453 1.1415 1.1461 1.1449 1.1635 1.1422 1.1647 1.1498 1.1546 2.0941 0.9837 0.9894 2.0512 0.9937 1.0305 4.5620 1.1644 1.1473 1.1444 1.0050
dispersion: -0.163530058 hartree
energy: -7900.976449765360 hartree
dipole: 10.246213365 -7.600767556 2.645445808 -6.256207332 5.121297316 -1.134910016 50.116630599 -40.664674390 9.451956209
dipolemethod: SCF
magnitude: 9.880580978 au
magnitude: 25.114440968 debye
temp: 298.15 k
press: 1.00 atm
zeropoint: 0.44308377 hartree
thermalvibcorrection: 0.06167261 hartree
thermalrotcorrection: 0.00141627 hartree
thermaltrasncorrection: 0.00141627 hartree
thermaltotal: -7900.46886084 hartree
thermalcorr: 0.06450515 hartree
nonthermalcorr: 0.44308377 hartree
totalcorr: 0.50758892 hartree
thermalcorrenthalpy: 0.00094421 hartree
totalenthalpy: -7900.46791664 hartree
vibrat: 0.11621768 hartree
rotat: 0.01900859 hartree
transl: 0.02222576 hartree
total: 0.15962609 hartree
totalentropycorr: -0.15962609 hartree
gibbsenthalpy: -7900.62754272 hartree
gibbsminuselec: 0.34890704 hartree
