program: Orca
programVersion: 6.0.0
elementType: Ni Ni Ni O H O O O O O O O O O O N N N N N C H C H C H C H C C C H C C H C H C C C H C H C H C H C C C C C C F F F C F F F C F F F C F F F C F F F O H H O H H
charge: 0
multiplicity: 7
keywords: TPSS D3BJ Freq def2-TZVPP def2/J RIJCOSX TightSCF defgrid3 CPCM(Acetonitrile)
frequency: 0.00 0.00 0.00 0.00 0.00 0.00 5.29 9.97 11.69 15.57 16.39 16.87 18.46 19.78 23.84 25.62 27.02 33.30 33.68 42.91 50.29 54.34 58.93 64.74 69.69 77.95 79.97 84.34 89.85 91.85 94.77 99.36 103.62 107.24 110.50 114.07 114.98 121.56 133.76 135.28 139.68 143.27 148.42 149.52 151.74 155.55 163.11 166.34 171.26 183.00 183.92 188.38 192.12 200.57 207.37 211.26 213.44 221.23 222.47 231.25 232.56 245.99 257.76 260.47 264.60 267.68 268.34 277.65 278.15 282.06 284.88 297.35 305.33 307.66 311.69 312.22 314.77 343.97 351.79 355.51 363.06 374.95 411.92 419.47 422.42 429.08 434.09 437.22 443.09 446.62 449.42 450.44 453.86 456.48 457.24 463.79 466.30 471.29 492.29 493.22 493.66 494.03 494.26 494.62 507.80 519.15 559.65 577.38 580.75 586.30 587.32 590.82 591.46 592.80 612.02 635.53 641.98 651.00 657.11 681.27 691.84 694.77 695.26 696.72 697.96 710.53 718.76 738.31 746.36 753.26 759.86 760.94 762.02 762.09 763.27 763.95 774.24 789.94 797.72 804.07 817.14 817.77 820.07 824.22 826.55 855.30 902.97 904.06 952.73 960.13 964.94 974.35 987.11 991.40 1014.32 1015.08 1017.85 1018.57 1046.53 1047.79 1048.07 1049.08 1049.23 1053.43 1055.91 1058.13 1089.60 1094.66 1095.71 1096.37 1096.79 1097.16 1102.12 1124.85 1129.40 1150.60 1152.12 1153.52 1154.23 1155.73 1162.29 1165.73 1175.04 1228.49 1259.28 1282.15 1292.51 1298.33 1302.58 1321.99 1349.42 1358.80 1382.59 1386.80 1387.68 1388.96 1391.95 1393.19 1421.24 1455.27 1461.28 1472.86 1480.39 1523.45 1547.47 1560.62 1577.72 1581.38 1606.56 1609.93 1612.75 1613.63 1625.47 1627.44 1633.68 1634.81 1643.48 1668.24 3158.52 3162.46 3170.15 3174.92 3175.82 3182.83 3186.19 3190.74 3204.37 3219.73 3252.34 3350.67 3396.87 3665.17 3726.36 3742.81
frequency: 5.29 9.97 11.69 15.57 16.39 16.87 18.46 19.78 23.84 25.62 27.02 33.30 33.68 42.91 50.29 54.34 58.93 64.74 69.69 77.95 79.97 84.34 89.85 91.85 94.77 99.36 103.62 107.24 110.50 114.07 114.98 121.56 133.76 135.28 139.68 143.27 148.42 149.52 151.74 155.55 163.11 166.34 171.26 183.00 183.92 188.38 192.12 200.57 207.37 211.26 213.44 221.23 222.47 231.25 232.56 245.99 257.76 260.47 264.60 267.68 268.34 277.65 278.15 282.06 284.88 297.35 305.33 307.66 311.69 312.22 314.77 343.97 351.79 355.51 363.06 374.95 411.92 419.47 422.42 429.08 434.09 437.22 443.09 446.62 449.42 450.44 453.86 456.48 457.24 463.79 466.30 471.29 492.29 493.22 493.66 494.03 494.26 494.62 507.80 519.15 559.65 577.38 580.75 586.30 587.32 590.82 591.46 592.80 612.02 635.53 641.98 651.00 657.11 681.27 691.84 694.77 695.26 696.72 697.96 710.53 718.76 738.31 746.36 753.26 759.86 760.94 762.02 762.09 763.27 763.95 774.24 789.94 797.72 804.07 817.14 817.77 820.07 824.22 826.55 855.30 902.97 904.06 952.73 960.13 964.94 974.35 987.11 991.40 1014.32 1015.08 1017.85 1018.57 1046.53 1047.79 1048.07 1049.08 1049.23 1053.43 1055.91 1058.13 1089.60 1094.66 1095.71 1096.37 1096.79 1097.16 1102.12 1124.85 1129.40 1150.60 1152.12 1153.52 1154.23 1155.73 1162.29 1165.73 1175.04 1228.49 1259.28 1282.15 1292.51 1298.33 1302.58 1321.99 1349.42 1358.80 1382.59 1386.80 1387.68 1388.96 1391.95 1393.19 1421.24 1455.27 1461.28 1472.86 1480.39 1523.45 1547.47 1560.62 1577.72 1581.38 1606.56 1609.93 1612.75 1613.63 1625.47 1627.44 1633.68 1634.81 1643.48 1668.24 3158.52 3162.46 3170.15 3174.92 3175.82 3182.83 3186.19 3190.74 3204.37 3219.73 3252.34 3350.67 3396.87 3665.17 3726.36 3742.81
formula: C26H16F15N5Ni3O13
InChI: InChI=1/C16H11N5.5C2F3O2.3Ni.2H2O.HO/c1-3-8-17-12(5-1)14-7-10-21-11-15(20-16(21)19-14)13-6-2-4-9-18-13;5*3-2(4,5)1(6)7;;;;;;/h1-11H;;;;;;;;;2*1H2;1H/q-4;4*-2;-1;2*+4;+5;;;/rC26H14F15N5Ni3O12.H2O/c27-22(28,29)16(50)56-49-44-9-4-2-5-12(44)14-7-10-42-11-15-13-6-1-3-8-43(13)48(51,45(15)21(42)46(14)49)57-17(23(30,31)32)52-47(61(48)49,53-18(58-48)24(33,34)35,54-19(59-49)25(36,37)38)55-20(60-49)26(39,40)41;/h1-11,61H,51H2;1H2
78 atoms
Ni 11.871575 7.189821 10.510311
Ni 11.396914 10.66558 9.539371
Ni 11.512354 9.650411 12.79677
O  11.968385 9.203996 10.868009
H  12.935627 9.393567 10.835395
O  9.960916 7.004135 11.248004
O  10.157203 8.164606 13.199087
O  12.742196 6.638286 12.29379
O  13.060474 8.521608 13.534414
O  13.268575 10.761152 8.608658
O  14.594064 9.8095 10.191968
O  12.14391 12.140324 10.798072
O  12.765616 11.270657 12.809242
O  9.473906 10.708944 10.274126
O  9.873446 10.853847 12.512509
N  11.756529 5.160032 10.00353
N  11.100273 7.325835 8.631394
N  10.69052 9.578586 7.90922
N  10.795785 12.18176 8.265917
N  10.167601 7.622145 6.622724
C  12.121765 4.128055 10.776307
H  12.541675 4.389602 11.740367
C  11.971474 2.804713 10.370819
H  12.280966 2.001745 11.030019
C  11.421994 2.542649 9.116177
H  11.292087 1.522386 8.771199
C  11.040426 3.608725 8.308646
H  10.609657 3.442865 7.327612
C  11.221433 4.908651 8.784825
C  10.859223 6.103971 8.040167
C  10.284893 6.264805 6.796387
H  9.957788 5.56377 6.045616
C  10.677533 8.247778 7.777008
C  9.675445 8.369934 5.591662
H  9.299382 7.834672 4.729605
C  9.691941 9.727776 5.720415
H  9.307856 10.332951 4.912079
C  10.20748 10.320465 6.90088
C  10.247179 11.775357 7.098249
C  9.756388 12.689966 6.163311
H  9.317588 12.352544 5.232998
C  9.834326 14.05086 6.444464
H  9.457389 14.776399 5.731833
C  10.398956 14.459877 7.648706
H  10.479409 15.508959 7.90944
C  10.868382 13.490498 8.533106
H  11.318254 13.751073 9.483101
C  9.612804 7.373861 12.395822
C  13.224157 7.315774 13.231122
C  14.364908 10.46781 9.148903
C  12.729343 12.139268 11.9055
C  9.186391 10.95542 11.471527
C  8.271164 6.736589 12.869056
F  7.944002 7.068036 14.136184
F  8.322903 5.380459 12.80501
F  7.246562 7.137176 12.068017
C  7.725542 11.464986 11.661851
F  7.499351 12.582503 10.921789
F  7.430684 11.764843 12.944545
F  6.833569 10.524103 11.25008
C  14.18538 6.504157 14.151834
F  14.650363 7.220965 15.19692
F  15.263148 6.064457 13.449015
F  13.561547 5.407829 14.6571
C  15.59985 11.009943 8.36227
F  16.772284 10.753605 8.981598
F  15.519986 12.354768 8.187178
F  15.664707 10.447169 7.124681
C  13.548951 13.438014 12.173551
F  14.554796 13.560556 11.266391
F  12.765225 14.541289 12.054588
F  14.107516 13.470109 13.401934
O  11.255787 10.162703 14.884375
H  11.662618 11.04226 14.965492
H  11.872166 9.570092 15.347899
O  13.8781 7.192311 9.749953
H  14.267773 8.087155 9.901437
H  13.847236 7.098151 8.783714
elementType: Ni O H N C F
totalener: -8277.45693902808125 hartree
cpcmener: -0.08794210368720 hartree
kineticenergy: 8255.87819489461617 hartree
exchangeener: -621.725082538557 hartree
correlationener: -19.405663836807 hartree
xcener: -641.130746375363 hartree
s2: 12.011071
energy: -8135.8219 -8135.7157 -8135.6397 -962.5921 -962.4861 -962.3658 -838.5808 -838.5741 -838.5359 -838.4802 -838.4580 -838.4349 -838.3487 -838.3422 -838.3262 -665.2341 -665.2319 -665.2211 -665.2177 -665.2161 -665.2133 -665.2118 -665.2080 -665.2002 -665.1966 -665.1963 -665.1922 -665.1920 -665.1898 -665.1892 -514.6378 -514.5481 -514.1391 -514.1283 -514.0637 -514.0547 -514.0534 -514.0473 -514.0279 -514.0191 -514.0132 -513.8422 -513.5694 -386.8863 -385.3362 -384.9040 -384.8018 -384.7256 -278.4775 -278.4757 -278.4484 -278.4442 -278.4244 -275.4568 -275.4485 -275.3858 -275.3770 -275.3752 -275.2773 -274.2202 -274.1602 -273.7449 -273.6857 -273.6067 -273.5087 -273.2502 -273.1806 -272.9123 -272.7237 -272.6921 -272.6585 -272.5731 -272.5296 -272.4236 -105.0053 -104.9031 -104.8162 -67.1439 -67.1349 -67.0518 -67.0445 -67.0170 -66.9501 -66.9378 -66.9341 -66.8983 -33.5779 -33.5756 -33.5525 -33.5483 -33.5405 -31.3695 -31.3666 -31.3450 -31.3409 -31.3322 -31.3239 -31.3219 -31.3009 -31.2953 -31.2931 -27.7607 -27.7072 -27.6863 -27.6251 -27.5783 -27.5646 -26.3739 -26.2506 -25.6035 -25.5622 -25.5240 -25.4733 -25.3796 -25.2724 -24.9138 -24.5182 -24.3203 -24.1520 -21.1228 -20.9300 -20.8407 -20.5656 -20.2677 -19.2482 -18.5174 -18.4977 -18.4656 -18.4488 -18.4365 -17.8927 -17.4657 -16.9763 -16.4847 -16.3749 -16.0096 -15.7956 -15.7565 -15.7090 -15.6728 -15.6633 -15.4320 -14.7455 -14.7426 -14.7311 -14.7217 -14.7142 -14.7102 -14.7090 -14.6957 -14.6794 -14.6728 -14.5434 -14.0187 -13.8102 -13.7303 -13.7202 -13.2888 -13.2106 -13.1027 -12.9615 -12.9059 -12.8776 -12.8495 -12.7206 -12.5222 -12.4574 -12.2607 -12.1064 -12.0318 -11.9849 -11.9132 -11.8866 -11.8319 -11.7216 -11.6230 -11.6037 -11.5123 -11.4800 -11.4079 -11.3995 -11.3435 -11.3364 -11.3308 -11.3075 -11.2986 -11.2819 -11.2261 -11.1270 -11.0924 -11.0064 -10.9763 -10.8831 -10.8566 -10.8118 -10.7539 -10.6656 -10.6395 -10.5455 -10.5260 -10.5061 -10.4737 -10.4077 -10.3599 -10.3515 -10.3436 -10.3370 -10.3293 -10.2955 -10.2315 -10.2091 -10.1841 -10.1048 -10.0442 -10.0095 -9.8370 -9.8242 -9.8216 -9.8137 -9.7976 -9.7925 -9.6578 -9.5951 -9.5430 -9.4006 -9.0615 -8.8645 -8.7394 -8.4519 -8.3611 -8.2123 -8.0808 -8.0511 -8.0002 -7.9088 -7.8115 -7.7958 -7.7407 -7.6281 -7.5445 -7.4465 -7.4079 -7.3652 -7.2964 -7.2466 -7.2233 -7.2042 -7.1752 -7.1477 -7.1162 -6.9247 -6.8682 -6.1286 -5.8852 -5.7971 -5.7709 -5.6904 -5.6536 -5.6030 -5.5417 -5.4988 -5.4180 -3.5459 -3.0296 -2.9375 -2.8506 -2.7021 -2.6120 -2.4839 -2.4539 -2.1387 -2.0187 -1.7296 electronvolt
chargesum: -0.0000000
charge: 0.837985 0.837675 0.882274 -0.888386 0.287331 -0.447737 -0.426442 -0.480016 -0.430481 -0.430152 -0.497992 -0.496738 -0.428866 -0.447172 -0.424726 -0.164548 -0.186162 -0.169265 -0.111520 0.104783 0.019174 0.113806 -0.079426 0.118132 -0.038034 0.123047 -0.120841 0.098310 0.084389 0.212640 -0.086912 0.144274 0.167796 0.009158 0.140472 -0.080545 0.104117 0.197809 0.131434 -0.103397 0.092834 -0.038340 0.127393 -0.077818 0.120041 0.031163 0.114967 0.329607 0.337134 0.310026 0.357003 0.338803 0.393863 -0.153001 -0.159239 -0.161531 0.394288 -0.159773 -0.152661 -0.160756 0.413074 -0.151875 -0.162482 -0.161212 0.401959 -0.153484 -0.160230 -0.161075 0.401120 -0.160588 -0.157939 -0.150940 -0.373324 0.260587 0.258714 -0.420632 0.262525 0.256549
charge: -0.197704 -0.194519 -0.200125 0.228476 -0.166402 0.174116 0.179839 0.188064 0.169078 0.161345 0.079643 0.190192 0.169970 0.171494 0.180078 0.289574 0.265292 0.294427 0.296066 0.365244 -0.034772 0.019814 0.012420 0.031054 0.036012 0.034345 0.038538 0.035861 -0.121152 -0.136700 0.010233 0.027241 -0.237332 0.037179 0.044791 0.026976 0.039908 -0.095858 -0.114287 0.044714 0.033238 0.040537 0.035796 0.021832 0.033219 -0.027009 0.018512 -0.520184 -0.516670 -0.559017 -0.520807 -0.519599 -0.621214 0.193135 0.180366 0.178031 -0.621293 0.179764 0.193428 0.178831 -0.620087 0.193769 0.179862 0.181299 -0.626141 0.191598 0.180083 0.176451 -0.620429 0.181259 0.182526 0.194134 0.412051 -0.069701 -0.070436 0.412240 -0.131046 -0.071461
qa: 0.8380 0.8377 0.8823 -0.8884 0.2873 -0.4477 -0.4264 -0.4800 -0.4305 -0.4302 -0.4980 -0.4967 -0.4289 -0.4472 -0.4247 -0.1645 -0.1862 -0.1693 -0.1115 0.1048 0.0192 0.1138 -0.0794 0.1181 -0.0380 0.1230 -0.1208 0.0983 0.0844 0.2126 -0.0869 0.1443 0.1678 0.0092 0.1405 -0.0805 0.1041 0.1978 0.1314 -0.1034 0.0928 -0.0383 0.1274 -0.0778 0.1200 0.0312 0.1150 0.3296 0.3371 0.3100 0.3570 0.3388 0.3939 -0.1530 -0.1592 -0.1615 0.3943 -0.1598 -0.1527 -0.1608 0.4131 -0.1519 -0.1625 -0.1612 0.4020 -0.1535 -0.1602 -0.1611 0.4011 -0.1606 -0.1579 -0.1509 -0.3733 0.2606 0.2587 -0.4206 0.2625 0.2565
va: 3.3378 3.3550 3.3246 1.5328 0.9987 1.9922 2.0161 1.9761 1.9833 1.9856 1.9694 1.9567 1.9950 1.9968 2.0197 3.1016 2.9407 3.0239 3.1066 3.5321 4.0045 1.0283 3.9163 1.0008 3.9020 0.9984 3.9539 1.0132 3.8862 3.7843 3.9345 1.0035 4.1216 3.9197 1.0009 3.8678 1.0161 3.8974 3.8339 3.9523 1.0178 3.9074 0.9959 3.9216 0.9996 3.9929 1.0273 4.1534 4.1716 4.1670 4.1481 4.1407 4.5605 1.1626 1.1481 1.1417 4.5563 1.1463 1.1632 1.1427 4.5165 1.1655 1.1456 1.1432 4.5524 1.1623 1.1431 1.1424 4.5316 1.1459 1.1461 1.1653 2.0912 0.9874 0.9896 2.0738 1.0421 0.9899
dispersion: -0.165546148 hartree
energy: -8277.622485176522 hartree
dipole: -8.930575320 6.361678221 -2.568897099 -18.762513180 15.467208416 -3.295304764 -45.449914175 35.285692856 -10.164221319
dipolemethod: SCF
magnitude: 10.989525050 au
magnitude: 27.933152792 debye
temp: 298.15 k
press: 1.00 atm
zeropoint: 0.44538134 hartree
thermalvibcorrection: 0.06067898 hartree
thermalrotcorrection: 0.00141627 hartree
thermaltrasncorrection: 0.00141627 hartree
thermaltotal: -8277.11359231 hartree
thermalcorr: 0.06351153 hartree
nonthermalcorr: 0.44538134 hartree
totalcorr: 0.50889287 hartree
thermalcorrenthalpy: 0.00094421 hartree
totalenthalpy: -8277.11264810 hartree
vibrat: 0.11393003 hartree
rotat: 0.01898375 hartree
transl: 0.02222485 hartree
total: 0.15697591 hartree
totalentropycorr: -0.15697591 hartree
gibbsenthalpy: -8277.26962401 hartree
gibbsminuselec: 0.35286116 hartree
