program: Orca
programVersion: 6.0.0
elementType: Cu Cu Ni Ni N C H C H C H C H C C C H N C N C H C H C N C C H C H C H C H N N C H C H C H C H C C C H N C N C H C H C N C C H C H C H C H N O O O O O O C O O C O O C O O C O O C O O C H H H H H H C F F F C F F F C F F F C F F F C F F F C F F F
charge: 0
multiplicity: 7
keywords: TPSS D3BJ Freq def2-TZVPP def2/J RIJCOSX TightSCF defgrid3 CPCM(Acetonitrile)
formula: C44H28Cu2F18N10Ni2O16
InChI: InChI=1/2C16H11N5.6C2F3O2.2Cu.2Ni.2H2O.2HO/c2*1-3-8-17-12(5-1)14-7-10-21-11-15(20-16(21)19-14)13-6-2-4-9-18-13;6*3-2(4,5)1(6)7;;;;;;;;/h2*1-11H;;;;;;;;;;;2*1H2;2*1H/q2*-4;;;;-2;2*-1;4*+3;;;;/rC38H28Cu2F9N10Ni2O10.3C2F3O2/c41-36(42,43)31(62)66-39-52-15-5-1-9-23(52)29-21-50-19-13-27-25-11-3-7-17-54(25)60(64,58(27)34(50)56(29)39)68-33(38(47,48)49)69-61(65,70(39)60)55-18-8-4-12-26(55)28-14-20-51-22-30-24-10-2-6-16-53(24)40(71(60)61,57(30)35(51)59(28)61)67-32(63)37(44,45)46;3*3-2(4,5)1(6)7/h1-22,70-71H,64-65H2;;;
120 atoms
Cu 5.78446 7.133552 9.424478
Cu 6.616337 6.700196 4.247474
Ni 8.024192 5.584343 7.306188
Ni 5.082214 4.88151 6.765012
N  6.031707 9.059261 10.083958
C  6.732427 9.435526 11.160749
H  7.198084 8.635123 11.723864
C  6.855522 10.772362 11.528177
H  7.438932 11.037255 12.402181
C  6.221638 11.744709 10.755884
H  6.300785 12.794425 11.017191
C  5.486814 11.356962 9.639387
H  4.987623 12.087504 9.01314
C  5.413153 10.000461 9.327041
C  4.723029 9.448173 8.173516
C  3.899489 9.996432 7.21385
H  3.5310 10.996524 7.05351
N  3.564517 8.952293 6.380262
C  4.204539 7.798865 6.857558
N  4.901639 8.100946 7.943731
C  2.774401 8.883817 5.265841
H  2.298734 9.799933 4.941959
C  2.646431 7.677401 4.640524
H  2.025282 7.609518 3.759432
C  3.335861 6.544525 5.14012
N  4.103567 6.622139 6.237966
C  3.287289 5.223957 4.504077
C  2.542989 4.949205 3.357535
H  1.96418 5.725355 2.873162
C  2.551721 3.655735 2.844732
H  1.980116 3.418816 1.954178
C  3.300889 2.676757 3.490767
H  3.333647 1.656718 3.12606
C  4.030645 3.028099 4.62478
H  4.641262 2.309227 5.157901
N  4.030373 4.271558 5.116392
N  5.780017 8.170932 3.110644
C  5.073374 7.981265 1.989123
H  4.977738 6.953533 1.659577
C  4.496981 9.041704 1.296194
H  3.926043 8.846201 0.396121
C  4.668184 10.337454 1.780935
H  4.228813 11.182714 1.262412
C  5.405765 10.538664 2.943852
H  5.551245 11.531328 3.35406
C  5.948166 9.429847 3.590068
C  6.710879 9.475594 4.825526
C  7.243239 10.503359 5.572686
H  7.227785 11.574643 5.455273
N  7.892968 9.892551 6.622983
C  7.730352 8.507108 6.483019
N  7.011116 8.257327 5.39781
C  8.612049 10.393757 7.673108
H  8.705774 11.469669 7.737012
C  9.156061 9.510437 8.560162
H  9.730007 9.893444 9.391634
C  8.953225 8.118594 8.386941
N  8.23733 7.63841 7.35898
C  9.485331 7.105129 9.304308
C  10.224516 7.413138 10.446059
H  10.426269 8.44238 10.7141
C  10.695015 6.374336 11.244301
H  11.267957 6.591791 12.138905
C  10.418701 5.060824 10.877399
H  10.767734 4.22254 11.468932
C  9.664572 4.827999 9.728869
H  9.407941 3.826634 9.405241
N  9.202435 5.823778 8.963837
O  6.211102 5.561432 8.327758
O  6.80268 5.390961 5.69014
O  3.538198 4.261738 7.985193
O  9.688952 5.384404 6.046645
O  6.666645 6.415998 11.049048
O  6.579511 4.182093 10.61455
C  6.76389 5.178372 11.328756
O  6.189051 5.345862 2.872266
O  7.271809 3.557662 3.773664
C  6.673459 4.168856 2.8762
O  8.08623 3.524037 7.471569
O  5.90874 2.992103 7.05043
C  7.10941 2.74911 7.31202
O  3.850233 7.102146 10.568312
O  3.20428 4.919262 10.546868
C  3.214818 6.096024 10.966822
O  10.181597 7.62374 4.755167
O  8.657169 6.983663 3.19556
C  9.566008 7.706191 3.662403
O  -0.375867 5.92384 5.742693
O  1.203843 4.661813 6.769362
C  0.383755 5.616469 6.67697
H  6.299323 4.870413 9.033749
H  7.074077 4.59593 5.16376
H  3.530774 4.596626 8.924954
H  2.641281 4.481025 7.604586
H  10.487043 5.204677 6.568056
H  9.872271 6.249791 5.555171
C  10.039215 8.88491 2.74738
F  10.358283 9.998416 3.457879
F  11.156605 8.526864 2.049607
F  9.106012 9.25428 1.835931
C  2.30305 6.400555 12.202543
F  3.051592 6.787907 13.275985
F  1.435084 7.418249 11.942089
F  1.55892 5.343064 12.604911
C  0.328621 6.528288 7.955591
F  -0.064621 5.81957 9.054252
F  1.551746 7.057557 8.255041
F  -0.525305 7.575967 7.841826
C  6.511712 3.429414 1.511184
F  5.460051 3.870999 0.784424
F  7.631124 3.619363 0.757474
F  6.359897 2.095538 1.675918
C  7.485706 1.244095 7.465469
F  8.041578 1.005874 8.681948
F  8.399841 0.881945 6.526969
F  6.426036 0.418542 7.336761
C  7.126353 4.920605 12.824883
F  7.783158 3.751008 12.994188
F  5.983816 4.854733 13.564901
F  7.894261 5.89797 13.361275
elementType: Cu Ni N C H O F
cpcmener: -0.19976261060978 hartree
exchangeener: -878.784502437671 hartree
correlationener: -27.934016181723 hartree
xcener: -906.718518619394 hartree
s2: 12.014159
chargesum: -0.0000000
charge: 0.504782 0.451545 0.867347 0.839388 -0.099163 0.029340 0.126761 -0.076667 0.119006 -0.029299 0.125105 -0.120209 0.101035 -0.050098 0.377758 -0.111905 0.139524 0.155742 0.135427 -0.018534 0.008574 0.135417 -0.060479 0.093014 0.215389 -0.155134 0.208010 -0.179075 0.087210 -0.022035 0.125991 -0.095871 0.114565 0.046930 0.110972 -0.128184 -0.054324 0.030335 0.129489 -0.073435 0.120455 -0.029548 0.125770 -0.130869 0.102064 -0.026908 0.400970 -0.122311 0.138558 0.161696 0.178099 -0.089402 0.016322 0.138671 -0.067668 0.100294 0.215406 -0.167109 0.135395 -0.121387 0.092348 -0.028135 0.127290 -0.083905 0.117925 0.048172 0.107644 -0.151948 -0.875239 -0.843179 -0.532404 -0.441525 -0.478211 -0.458104 0.356758 -0.481332 -0.454939 0.320536 -0.474234 -0.451105 0.378309 -0.516426 -0.488116 0.297939 -0.471270 -0.508765 0.277819 -0.476615 -0.495087 0.231809 0.340453 0.360906 0.263859 0.267759 0.237219 0.264943 0.420129 -0.167136 -0.166942 -0.164481 0.409626 -0.171350 -0.171406 -0.162877 0.408231 -0.182693 -0.177834 -0.171756 0.434895 -0.158899 -0.160713 -0.158816 0.396369 -0.157987 -0.159031 -0.151352 0.429493 -0.158727 -0.160655 -0.159978
charge: -0.157717 -0.155289 -0.171133 -0.172672 0.290144 -0.022402 0.028706 0.020752 0.033860 0.044886 0.036884 0.046368 0.039091 -0.118063 -0.136656 0.018064 0.030087 0.369908 -0.244297 0.267815 0.040059 0.046245 0.032780 0.042525 -0.096530 0.313571 -0.113808 0.045473 0.034850 0.041313 0.036399 0.022494 0.033884 -0.029139 0.025087 0.304885 0.290206 -0.018741 0.028880 0.022765 0.034546 0.047196 0.037461 0.047722 0.039624 -0.117621 -0.138129 0.020264 0.030854 0.371632 -0.242947 0.265186 0.042427 0.046877 0.034290 0.042975 -0.090020 0.313435 -0.108642 0.049485 0.035579 0.044023 0.037273 0.024613 0.034828 -0.025846 0.024804 0.300398 0.235546 0.237296 0.382298 0.396982 0.165031 0.099090 -0.547631 0.164279 0.097510 -0.544464 0.176836 0.182520 -0.520847 0.109356 0.062555 -0.591527 0.076656 0.101870 -0.586975 -0.030590 0.033200 -0.649438 -0.163132 -0.163126 -0.164817 -0.170206 -0.083326 -0.159798 -0.619189 0.174772 0.167436 0.181814 -0.619730 0.164552 0.167219 0.179650 -0.620536 0.162596 0.175592 0.173144 -0.624162 0.192753 0.178080 0.192462 -0.622325 0.182802 0.181334 0.195310 -0.624179 0.192654 0.178447 0.190538
qa: 0.5048 0.4515 0.8673 0.8394 -0.0992 0.0293 0.1268 -0.0767 0.1190 -0.0293 0.1251 -0.1202 0.1010 -0.0501 0.3778 -0.1119 0.1395 0.1557 0.1354 -0.0185 0.0086 0.1354 -0.0605 0.0930 0.2154 -0.1551 0.2080 -0.1791 0.0872 -0.0220 0.1260 -0.0959 0.1146 0.0469 0.1110 -0.1282 -0.0543 0.0303 0.1295 -0.0734 0.1205 -0.0295 0.1258 -0.1309 0.1021 -0.0269 0.4010 -0.1223 0.1386 0.1617 0.1781 -0.0894 0.0163 0.1387 -0.0677 0.1003 0.2154 -0.1671 0.1354 -0.1214 0.0923 -0.0281 0.1273 -0.0839 0.1179 0.0482 0.1076 -0.1519 -0.8752 -0.8432 -0.5324 -0.4415 -0.4782 -0.4581 0.3568 -0.4813 -0.4549 0.3205 -0.4742 -0.4511 0.3783 -0.5164 -0.4881 0.2979 -0.4713 -0.5088 0.2778 -0.4766 -0.4951 0.2318 0.3405 0.3609 0.2639 0.2678 0.2372 0.2649 0.4201 -0.1671 -0.1669 -0.1645 0.4096 -0.1713 -0.1714 -0.1629 0.4082 -0.1827 -0.1778 -0.1718 0.4349 -0.1589 -0.1607 -0.1588 0.3964 -0.1580 -0.1590 -0.1514 0.4295 -0.1587 -0.1607 -0.1600
va: 2.4146 2.4662 3.3329 3.3905 3.1327 4.0183 1.0133 3.9103 1.0007 3.8999 0.9978 3.9574 1.0136 4.0399 3.4151 3.9684 1.0074 3.5115 4.0643 3.0570 3.9201 1.0055 3.8516 1.0255 3.7907 3.0277 3.6961 4.0298 1.0210 3.8931 0.9956 3.9408 1.0045 4.0062 1.0269 3.0803 3.1713 4.0159 1.0131 3.9044 1.0005 3.9045 0.9978 3.9645 1.0133 4.0248 3.3017 3.9629 1.0073 3.4929 3.9766 2.9555 3.9247 1.0043 3.8430 1.0214 3.8781 3.0544 3.8534 3.9696 1.0183 3.9035 0.9958 3.9392 1.0036 4.0033 1.0331 3.1056 1.5472 1.5372 1.9998 2.0713 1.9873 2.0597 4.1149 1.9920 2.0562 4.1848 1.9817 1.9776 4.0622 1.8731 2.0045 4.2076 2.0277 1.9032 4.2648 2.0031 1.9549 4.4563 0.9666 0.9234 1.0700 1.0607 1.0027 1.0613 4.4769 1.1343 1.1367 1.1423 4.5194 1.1243 1.1250 1.1468 4.2688 1.1127 1.0958 1.1385 4.5038 1.1505 1.1471 1.1573 4.5445 1.1519 1.1490 1.1648 4.5230 1.1578 1.1466 1.1479
dispersion: -0.314251797 hartree
dipole: 4.267079692 2.361853852 6.628933544 48.897392866 -31.914326886 16.983065980 -14.283542936 11.776997023 -2.506545913
dipolemethod: SCF
magnitude: 18.402447186 au
magnitude: 46.775303452 debye
temp: 298.15 k
press: 1.00 atm
zeropoint: 0.73002222 hartree
thermalvibcorrection: 0.08750931 hartree
thermalrotcorrection: 0.00141627 hartree
thermaltrasncorrection: 0.00141627 hartree
thermalcorr: 0.09034185 hartree
nonthermalcorr: 0.73002222 hartree
totalcorr: 0.82036407 hartree
thermalcorrenthalpy: 0.00094421 hartree
vibrat: 0.16381867 hartree
rotat: 0.01982983 hartree
transl: 0.02274314 hartree
total: 0.20822893 hartree
totalentropycorr: -0.20822893 hartree
gibbsminuselec: 0.61307935 hartree
