program: Orca
programVersion: 6.0.0
elementType: Cu Cu Ni Ni N C H C H C H C H C C C H N C N C H C H C N C C H C H C H C H N N C H C H C H C H C C C H N C N C H C H C N C C H C H C H C H N O O O O O O C O O C O O C O O C O O C O O C H H H H H H C F F F C F F F C F F F C F F F C F F F C F F F
charge: 0
multiplicity: 7
keywords: TPSS D3BJ Freq def2-TZVPP def2/J RIJCOSX TightSCF defgrid3 CPCM(Acetonitrile)
formula: C44H28Cu2F18N10Ni2O16
InChI: InChI=1/2C16H11N5.6C2F3O2.2Cu.2Ni.2H2O.2HO/c2*1-3-8-17-12(5-1)14-7-10-21-11-15(20-16(21)19-14)13-6-2-4-9-18-13;6*3-2(4,5)1(6)7;;;;;;;;/h2*1-11H;;;;;;;;;;;2*1H2;2*1H/q2*-4;;;;-2;2*-1;4*+3;;;;/rC38H28Cu2F9N10Ni2O10.3C2F3O2/c41-36(42,43)31(62)66-39-52-15-5-1-9-23(52)27-13-19-50-21-29-25-11-3-7-17-54(25)60(64,58(29)34(50)56(27)39)68-33(38(47,48)49)69-61(65,70(39)60)55-18-8-4-12-26(55)30-22-51-20-14-28-24-10-2-6-16-53(24)40(71(60)61,57(28)35(51)59(30)61)67-32(63)37(44,45)46;3*3-2(4,5)1(6)7/h1-22,70-71H,64-65H2;;;
120 atoms
Cu 5.615683 7.218267 9.25975
Cu 6.276957 6.687079 4.073598
Ni 7.816947 5.639444 7.097756
Ni 4.906931 4.84663 6.69725
N  3.75317 4.296578 5.059533
C  3.734065 3.091451 4.477302
H  4.372645 2.33918 4.926049
C  2.954036 2.819382 3.356561
H  2.974424 1.829823 2.914888
C  2.167678 3.837703 2.81958
H  1.556601 3.658649 1.941514
C  2.174389 5.089727 3.424749
H  1.573033 5.904509 3.038233
C  2.973392 5.282873 4.550341
C  3.068646 6.538271 5.277381
C  2.472027 7.770911 5.101423
H  1.758907 8.141697 4.383515
N  2.995782 8.57435 6.088036
C  3.892185 7.791281 6.838384
N  3.934162 6.567262 6.346728
C  2.809299 9.89068 6.401958
H  2.106531 10.447176 5.795908
C  3.521913 10.413595 7.444145
H  3.386712 11.454571 7.702049
C  4.412359 9.590478 8.175082
N  4.579893 8.295565 7.867092
C  5.226348 10.06678 9.296418
C  5.351159 11.408426 9.653877
H  4.814327 12.175934 9.110778
C  6.192686 11.747898 10.71024
H  6.310989 12.786659 10.998499
C  6.876998 10.740498 11.384003
H  7.541395 10.96209 12.210977
C  6.697803 9.419192 10.979912
H  7.195032 8.59202 11.471655
N  5.89871 9.094218 9.958424
N  9.051793 6.099678 8.706163
C  9.596966 5.222531 9.559171
H  9.384821 4.17829 9.361574
C  10.375755 5.6229 10.641498
H  10.789442 4.87754 11.310727
C  10.59844 6.983986 10.844182
H  11.194354 7.327368 11.682848
C  10.046351 7.901221 9.955871
H  10.199989 8.966916 10.081701
C  9.278748 7.42537 8.893528
C  8.641427 8.274204 7.898904
C  8.612996 9.642129 7.710114
H  9.052724 10.464572 8.250575
N  7.822524 9.841223 6.601588
C  7.404334 8.576439 6.149816
N  7.891469 7.636929 6.937609
C  7.409322 10.970739 5.954067
H  7.755462 11.918002 6.346324
C  6.592989 10.830322 4.867122
H  6.259858 11.713244 4.340247
C  6.217085 9.53855 4.429232
N  6.62707 8.434083 5.072042
C  5.376146 9.290021 3.256862
C  4.682611 10.285288 2.571279
H  4.755422 11.32027 2.881412
C  3.877923 9.923037 1.493777
H  3.321393 10.68007 0.952296
C  3.7967 8.582929 1.12752
H  3.182102 8.259259 0.295793
C  4.524551 7.640829 1.851587
H  4.506852 6.585575 1.608791
N  5.289426 7.98723 2.892566
O  6.044137 5.625655 8.200437
O  6.554242 5.406987 5.522788
O  3.449482 4.129209 7.983692
O  9.463442 5.387781 5.810634
O  6.556257 6.493775 10.86765
O  6.551503 4.254347 10.458322
C  6.719576 5.265737 11.154761
O  5.924413 5.242688 2.74567
O  7.051195 3.503645 3.686131
C  6.428353 4.075691 2.779589
O  7.946936 3.604571 7.396536
O  5.808862 2.98633 6.893862
C  7.007104 2.791548 7.20367
O  3.701486 7.132101 10.404581
O  3.190124 4.917057 10.528995
C  3.142412 6.11363 10.881785
O  9.957465 7.590853 4.437461
O  8.276889 7.020983 3.015663
C  9.255183 7.699791 3.401797
O  -0.63515 5.540283 5.868199
O  1.027562 4.375328 6.880414
C  0.166908 5.292471 6.785092
H  6.185645 4.957136 8.920097
H  6.827128 4.607109 5.003986
H  3.460666 4.508728 8.904937
H  2.528782 4.291804 7.634211
H  10.266504 5.21677 6.327115
H  9.643595 6.239582 5.299055
C  9.693359 8.881058 2.472707
F  9.696974 10.063919 3.150926
F  10.956213 8.694578 1.997905
F  8.886645 9.048257 1.398194
C  2.263472 6.433388 12.137091
F  3.043605 6.848581 13.178149
F  1.376013 7.435756 11.888115
F  1.546179 5.374786 12.582427
C  0.112138 6.241198 8.036979
F  -0.18512 5.548568 9.175462
F  1.310986 6.855708 8.260982
F  -0.811125 7.23022 7.932084
C  6.254365 3.286121 1.443851
F  5.203647 3.708735 0.704791
F  7.371903 3.43452 0.678646
F  6.09006 1.961309 1.662933
C  7.431717 1.304243 7.393293
F  6.431071 0.432403 7.146869
F  7.856171 1.085767 8.666606
F  8.461301 0.984682 6.566428
C  7.15741 5.035916 12.63565
F  7.934151 3.936297 12.766781
F  7.841873 6.08007 13.157509
F  6.054189 4.847896 13.412954
elementType: Cu Ni N C H O F
cpcmener: -0.21568102717842 hartree
exchangeener: -878.784174679628 hartree
correlationener: -27.929867870040 hartree
xcener: -906.714042549668 hartree
s2: 12.012215
chargesum: -0.0000000
charge: 0.547295 0.507548 0.840243 0.816028 -0.174309 0.025686 0.108802 -0.094462 0.111984 -0.028987 0.121399 -0.182173 0.090824 0.189708 0.199266 -0.149354 0.128239 0.179808 0.150450 -0.081001 0.009631 0.136786 -0.109989 0.104651 0.335291 -0.086795 0.060093 -0.091293 0.096582 -0.035891 0.129055 -0.077599 0.120935 0.045868 0.133745 -0.059291 -0.182575 0.033190 0.106491 -0.086549 0.115815 -0.027750 0.123038 -0.141688 0.096697 0.087663 0.219263 -0.105400 0.139215 0.138812 0.210152 -0.106623 0.018832 0.138290 -0.119703 0.103343 0.397493 -0.161493 0.048784 -0.096059 0.097419 -0.035713 0.129600 -0.070805 0.122927 0.049764 0.134592 -0.039013 -0.886800 -0.860366 -0.539235 -0.449469 -0.487509 -0.454773 0.355255 -0.482854 -0.453030 0.324143 -0.470814 -0.449096 0.383692 -0.515355 -0.486978 0.303688 -0.470456 -0.500824 0.264657 -0.479839 -0.496298 0.231968 0.341979 0.363438 0.261347 0.269626 0.235322 0.265485 0.421108 -0.169124 -0.164098 -0.164189 0.414260 -0.172107 -0.171210 -0.162869 0.408331 -0.183422 -0.178183 -0.173101 0.430758 -0.158282 -0.160697 -0.158613 0.391310 -0.151746 -0.160572 -0.158830 0.426812 -0.158899 -0.159425 -0.160896
charge: -0.139073 -0.135116 -0.185815 -0.186067 0.301820 -0.038702 0.025219 0.012627 0.031351 0.035760 0.034639 0.039140 0.036500 -0.118970 -0.134671 0.016009 0.028517 0.370349 -0.244383 0.293248 0.042238 0.046468 0.032602 0.043047 -0.095102 0.295252 -0.109032 0.052086 0.037021 0.049094 0.038090 0.029158 0.035743 -0.014218 0.026929 0.293357 0.297177 -0.035549 0.025267 0.014603 0.032240 0.038688 0.035537 0.042113 0.037476 -0.115151 -0.129471 0.018594 0.029031 0.372433 -0.241919 0.292617 0.044363 0.046983 0.033122 0.044001 -0.095795 0.292681 -0.108821 0.053938 0.037942 0.051504 0.038706 0.031475 0.036483 -0.010559 0.027201 0.292405 0.234367 0.235962 0.379786 0.395034 0.167455 0.100625 -0.548980 0.167064 0.097384 -0.545967 0.173684 0.180034 -0.521778 0.110248 0.063550 -0.590358 0.073318 0.106986 -0.586875 -0.033334 0.028137 -0.650836 -0.166720 -0.166258 -0.163763 -0.167659 -0.084315 -0.158366 -0.619088 0.170945 0.171010 0.182179 -0.619784 0.163867 0.168557 0.180206 -0.620731 0.161921 0.176966 0.171478 -0.624198 0.192919 0.178403 0.191971 -0.622268 0.193950 0.179978 0.181279 -0.624224 0.191901 0.191196 0.178712
qa: 0.5473 0.5075 0.8402 0.8160 -0.1743 0.0257 0.1088 -0.0945 0.1120 -0.0290 0.1214 -0.1822 0.0908 0.1897 0.1993 -0.1494 0.1282 0.1798 0.1504 -0.0810 0.0096 0.1368 -0.1100 0.1047 0.3353 -0.0868 0.0601 -0.0913 0.0966 -0.0359 0.1291 -0.0776 0.1209 0.0459 0.1337 -0.0593 -0.1826 0.0332 0.1065 -0.0865 0.1158 -0.0277 0.1230 -0.1417 0.0967 0.0877 0.2193 -0.1054 0.1392 0.1388 0.2102 -0.1066 0.0188 0.1383 -0.1197 0.1033 0.3975 -0.1615 0.0488 -0.0961 0.0974 -0.0357 0.1296 -0.0708 0.1229 0.0498 0.1346 -0.0390 -0.8868 -0.8604 -0.5392 -0.4495 -0.4875 -0.4548 0.3553 -0.4829 -0.4530 0.3241 -0.4708 -0.4491 0.3837 -0.5154 -0.4870 0.3037 -0.4705 -0.5008 0.2647 -0.4798 -0.4963 0.2320 0.3420 0.3634 0.2613 0.2696 0.2353 0.2655 0.4211 -0.1691 -0.1641 -0.1642 0.4143 -0.1721 -0.1712 -0.1629 0.4083 -0.1834 -0.1782 -0.1731 0.4308 -0.1583 -0.1607 -0.1586 0.3913 -0.1517 -0.1606 -0.1588 0.4268 -0.1589 -0.1594 -0.1609
va: 2.3840 2.4126 3.3591 3.4165 3.0521 4.0230 1.0281 3.9322 1.0061 3.9041 0.9983 4.0109 1.0181 3.7241 3.6778 3.9534 1.0170 3.4965 3.9940 2.9607 3.9209 1.0034 3.8740 1.0165 3.6678 3.1491 3.9213 3.9392 1.0165 3.9114 0.9957 3.9134 0.9997 4.0019 1.0024 3.1778 3.0865 4.0127 1.0354 3.9322 1.0052 3.9041 0.9983 3.9666 1.0160 3.9255 3.7142 3.9592 1.0096 3.5143 3.8966 2.9963 3.9122 1.0021 3.8885 1.0172 3.5233 3.0785 3.9654 3.9378 1.0166 3.9150 0.9959 3.9079 0.9992 3.9980 1.0034 3.2126 1.5429 1.5359 1.9952 2.0595 1.9696 2.0659 4.1339 1.9760 2.0598 4.1908 1.9897 1.9849 4.0496 1.8716 2.0069 4.2009 2.0364 1.9012 4.2946 2.0008 1.9529 4.4616 0.9625 0.9189 1.0721 1.0589 1.0030 1.0595 4.4726 1.1262 1.1422 1.1475 4.5096 1.1233 1.1261 1.1474 4.2545 1.1122 1.0951 1.1365 4.5133 1.1507 1.1474 1.1574 4.5534 1.1640 1.1471 1.1492 4.5301 1.1574 1.1488 1.1466
dispersion: -0.310608217 hartree
dipole: 0.539622018 4.766041650 5.305663668 52.720126234 -33.325413025 19.394713209 -15.928069744 12.499884582 -3.428185162
dipolemethod: SCF
magnitude: 20.397485652 au
magnitude: 51.846288234 debye
temp: 298.15 k
press: 1.00 atm
zeropoint: 0.72981241 hartree
thermalvibcorrection: 0.08755958 hartree
thermalrotcorrection: 0.00141627 hartree
thermaltrasncorrection: 0.00141627 hartree
thermalcorr: 0.09039212 hartree
nonthermalcorr: 0.72981241 hartree
totalcorr: 0.82020453 hartree
thermalcorrenthalpy: 0.00094421 hartree
vibrat: 0.16363563 hartree
rotat: 0.01983384 hartree
transl: 0.02274314 hartree
total: 0.20804990 hartree
totalentropycorr: -0.20804990 hartree
gibbsminuselec: 0.61309884 hartree
